{"text_format":"1","workbook":"xlsx","n_sheets":10,"sheets":["GALA","FIRSTS","GIRLS","BOYS","Lane 1","Lane 2","Lane 3","Lane 4","Lane 5","Lane 6"],"not_rendered":{"charts":0,"images":0,"macros":0,"external_links":0,"defined_names":4,"comments":0,"pivot_tables":0},"unopened":[],"bounds":{"document_bytes":16777216,"sheet_cells":100000,"rows_first":2000,"rows_last":500,"rows_between":2000,"halvings":0,"cell_chars":16384,"cell_head_chars":4096},"cells_cut":0,"cells_raw":0,"read":"whole","date_system":"1900"}

{"sheet":"GALA","index":0,"n_rows":125,"n_cols":22,"rows_kept":125,"cut":false,"hidden":false,"merged":[[108,7,108,10],[3,17,3,19],[3,14,3,16],[3,11,3,13],[3,2,3,4],[3,5,3,7],[3,8,3,10],[122,8,122,10],[123,8,123,10],[117,8,117,10],[124,8,124,10],[118,8,118,10],[119,8,119,10],[120,8,120,10],[121,8,121,10]]}
[null,"Gala held at ",null,null,null,null,null,null,null,null,null,"Gala held on: "]
["No","Event","Lane 2",null,null,"Lane 3",null,null,"Lane 4",null,null,"Lane 5",null,null,"Lane 6",null,null,"Lane 7"]
[null,null,"Name/Time","Pos","Pts","Name/Time","Pos","Pts","Name/Time","Pos","Pts","Name/Time","Pos","Pts","Name/Time","Pos","Pts","Name/Time","Pos","Pts","Line check","Cum. check"]
[null,"Club Name",{"$f":"IF(ISBLANK('Lane 2'!$C1), \"\", 'Lane 2'!$C1)","v":""},null,null,{"$f":"IF(ISBLANK('Lane 3'!$C1), \"\", 'Lane 3'!$C1)","v":""},null,null,{"$f":"IF(ISBLANK('Lane 4'!$C1), \"\", 'Lane 4'!$C1)","v":""},null,null,{"$f":"IF(ISBLANK('Lane 5'!$C1), \"\", 'Lane 5'!$C1)","v":""},null,null,{"$f":"IF(ISBLANK('Lane 6'!$C1), \"\", 'Lane 6'!$C1)","v":""},null,null,{"$f":"IF(ISBLANK('Lane 1'!$C1), \"\", 'Lane 1'!$C1)","v":""}]
[1,"G 10yrs 2L ",{"$f":"IF(ISERROR(FIND(\"Relay\", $B6)),  IF('Lane 2'!$C3=\"Swimmer\", \"\", 'Lane 2'!$C3), \"Relay\")","v":"Faith Shepherd"},{"$f":"IF(OR(C6=\"DQ\",C6=\"DNS\"),\"-\",IF(C6=SMALL((C6,F6,I6,L6,O6,R6),1),1,IF(C6=SMALL((C6,F6,I6,L6,O6,R6),2),2,IF(C6=SMALL((C6,F6,I6,L6,O6,R6),3),3,IF(C6=SMALL((C6,F6,I6,L6,O6,R6),4),4,IF(C6=SMALL((C6,F6,I6,L6,O6,R6),5),5,IF(C6=SMALL((C6,F6,I6,L6,O6,R6),6),6)))))))","v":1},{"$f":"IF(ISTEXT(D5),0,7-D5)","v":6},{"$f":"IF(ISERROR(FIND(\"Relay\", $B6)),  IF('Lane 3'!$C3=\"Swimmer\", \"\", 'Lane 3'!$C3), \"Relay\")","v":"Elouise Brookes"},{"$f":"IF(OR(F6=\"DQ\",F6=\"DNS\"),\"-\",IF(F6=SMALL((C6,F6,I6,L6,O6,R6),1),1,IF(F6=SMALL((C6,F6,I6,L6,O6,R6),2),2,IF(F6=SMALL((C6,F6,I6,L6,O6,R6),3),3,IF(F6=SMALL((C6,F6,I6,L6,O6,R6),4),4,IF(F6=SMALL((C6,F6,I6,L6,O6,R6),5),5,IF(F6=SMALL((C6,F6,I6,L6,O6,R6),6),6)))))))","v":2},{"$f":"IF(ISTEXT(G5),0,7-G5)","v":5},{"$f":"IF(ISERROR(FIND(\"Relay\", $B6)),  IF('Lane 4'!$C3=\"Swimmer\", \"\", 'Lane 4'!$C3), \"Relay\")","v":"Khloe Deoso"},{"$f":"IF(OR(I6=\"DQ\",I6=\"DNS\"),\"-\",IF(I6=SMALL((C6,F6,I6,L6,O6,R6),1),1,IF(I6=SMALL((C6,F6,I6,L6,O6,R6),2),2,IF(I6=SMALL((C6,F6,I6,L6,O6,R6),3),3,IF(I6=SMALL((C6,F6,I6,L6,O6,R6),4),4,IF(I6=SMALL((C6,F6,I6,L6,O6,R6),5),5,IF(I6=SMALL((C6,F6,I6,L6,O6,R6),6),6)))))))","v":3},{"$f":"IF(ISTEXT(J5),0,7-J5)","v":4},{"$f":"IF(ISERROR(FIND(\"Relay\", $B6)),  IF('Lane 5'!$C3=\"Swimmer\", \"\", 'Lane 5'!$C3), \"Relay\")","v":"Waleeha Qaiser"},{"$f":"IF(OR(L6=\"DQ\",L6=\"DNS\"),\"-\",IF(L6=SMALL((C6,F6,I6,L6,O6,R6),1),1,IF(L6=SMALL((C6,F6,I6,L6,O6,R6),2),2,IF(L6=SMALL((C6,F6,I6,L6,O6,R6),3),3,IF(L6=SMALL((C6,F6,I6,L6,O6,R6),4),4,IF(L6=SMALL((C6,F6,I6,L6,O6,R6),5),5,IF(L6=SMALL((C6,F6,I6,L6,O6,R6),6),6)))))))","v":5},{"$f":"IF(ISTEXT(M5),0,7-M5)","v":2},{"$f":"IF(ISERROR(FIND(\"Relay\", $B6)),  IF('Lane 6'!$C3=\"Swimmer\", \"\", 'Lane 6'!$C3), \"Relay\")","v":"S Warrilow"},{"$f":"IF(OR(O6=\"DQ\",O6=\"DNS\"),\"-\",IF(O6=SMALL((C6,F6,I6,L6,O6,R6),1),1,IF(O6=SMALL((C6,F6,I6,L6,O6,R6),2),2,IF(O6=SMALL((C6,F6,I6,L6,O6,R6),3),3,IF(O6=SMALL((C6,F6,I6,L6,O6,R6),4),4,IF(O6=SMALL((C6,F6,I6,L6,O6,R6),5),5,IF(O6=SMALL((C6,F6,I6,L6,O6,R6),6),6)))))))","v":6},{"$f":"IF(ISTEXT(P5),0,7-P5)","v":1},{"$f":"IF(ISERROR(FIND(\"Relay\", $B6)),  IF('Lane 1'!$C3=\"Swimmer\", \"\", 'Lane 1'!$C3), \"Relay\")","v":"Scarlett Fletcher"},{"$f":"IF(OR(R6=\"DQ\",R6=\"DNS\"),\"-\",IF(R6=SMALL((C6,F6,I6,L6,O6,R6),1),1,IF(R6=SMALL((C6,F6,I6,L6,O6,R6),2),2,IF(R6=SMALL((C6,F6,I6,L6,O6,R6),3),3,IF(R6=SMALL((C6,F6,I6,L6,O6,R6),4),4,IF(R6=SMALL((C6,F6,I6,L6,O6,R6),5),5,IF(R6=SMALL((C6,F6,I6,L6,O6,R6),6),6)))))))","v":4},{"$f":"IF(ISTEXT(S5),0,7-S5)","v":3},{"$f":"T5+Q5+N5+K5+H5+E5","v":21}]
[null,"Freestyle","00:00:36.370",null,{"$f":"SUM(E5)","v":6},"00:00:37.020",null,{"$f":"SUM(H5)","v":5},"00:00:37.280",null,{"$f":"SUM(K5)","v":4},"00:01:00.970",null,{"$f":"SUM(N5)","v":2},"00:01:20.370",null,{"$f":"SUM(Q5)","v":1},"00:00:39.500",null,{"$f":"SUM(T5)","v":3},null,{"$f":"U5","v":21}]
[2,"B 10/u 2L ",{"$f":"IF(ISERROR(FIND(\"Relay\", $B8)),  IF('Lane 2'!$C5=\"Swimmer\", \"\", 'Lane 2'!$C5), \"Relay\")","v":"Zac Matthews"},{"$f":"IF(OR(C8=\"DQ\",C8=\"DNS\"),\"-\",IF(C8=SMALL((C8,F8,I8,L8,O8,R8),1),1,IF(C8=SMALL((C8,F8,I8,L8,O8,R8),2),2,IF(C8=SMALL((C8,F8,I8,L8,O8,R8),3),3,IF(C8=SMALL((C8,F8,I8,L8,O8,R8),4),4,IF(C8=SMALL((C8,F8,I8,L8,O8,R8),5),5,IF(C8=SMALL((C8,F8,I8,L8,O8,R8),6),6)))))))","v":"-"},{"$f":"IF(ISTEXT(D7),0,7-D7)","v":0},{"$f":"IF(ISERROR(FIND(\"Relay\", $B8)),  IF('Lane 3'!$C5=\"Swimmer\", \"\", 'Lane 3'!$C5), \"Relay\")","v":"Charlie Hodgetts"},{"$f":"IF(OR(F8=\"DQ\",F8=\"DNS\"),\"-\",IF(F8=SMALL((C8,F8,I8,L8,O8,R8),1),1,IF(F8=SMALL((C8,F8,I8,L8,O8,R8),2),2,IF(F8=SMALL((C8,F8,I8,L8,O8,R8),3),3,IF(F8=SMALL((C8,F8,I8,L8,O8,R8),4),4,IF(F8=SMALL((C8,F8,I8,L8,O8,R8),5),5,IF(F8=SMALL((C8,F8,I8,L8,O8,R8),6),6)))))))","v":4},{"$f":"IF(ISTEXT(G7),0,7-G7)","v":3},{"$f":"IF(ISERROR(FIND(\"Relay\", $B8)),  IF('Lane 4'!$C5=\"Swimmer\", \"\", 'Lane 4'!$C5), \"Relay\")","v":"Toru Ashton"},{"$f":"IF(OR(I8=\"DQ\",I8=\"DNS\"),\"-\",IF(I8=SMALL((C8,F8,I8,L8,O8,R8),1),1,IF(I8=SMALL((C8,F8,I8,L8,O8,R8),2),2,IF(I8=SMALL((C8,F8,I8,L8,O8,R8),3),3,IF(I8=SMALL((C8,F8,I8,L8,O8,R8),4),4,IF(I8=SMALL((C8,F8,I8,L8,O8,R8),5),5,IF(I8=SMALL((C8,F8,I8,L8,O8,R8),6),6)))))))","v":3},{"$f":"IF(ISTEXT(J7),0,7-J7)","v":4},{"$f":"IF(ISERROR(FIND(\"Relay\", $B8)),  IF('Lane 5'!$C5=\"Swimmer\", \"\", 'Lane 5'!$C5), \"Relay\")","v":"Veer Mulji"},{"$f":"IF(OR(L8=\"DQ\",L8=\"DNS\"),\"-\",IF(L8=SMALL((C8,F8,I8,L8,O8,R8),1),1,IF(L8=SMALL((C8,F8,I8,L8,O8,R8),2),2,IF(L8=SMALL((C8,F8,I8,L8,O8,R8),3),3,IF(L8=SMALL((C8,F8,I8,L8,O8,R8),4),4,IF(L8=SMALL((C8,F8,I8,L8,O8,R8),5),5,IF(L8=SMALL((C8,F8,I8,L8,O8,R8),6),6)))))))","v":2},{"$f":"IF(ISTEXT(M7),0,7-M7)","v":5},null,{"$f":"IF(OR(O8=\"DQ\",O8=\"DNS\"),\"-\",IF(O8=SMALL((C8,F8,I8,L8,O8,R8),1),1,IF(O8=SMALL((C8,F8,I8,L8,O8,R8),2),2,IF(O8=SMALL((C8,F8,I8,L8,O8,R8),3),3,IF(O8=SMALL((C8,F8,I8,L8,O8,R8),4),4,IF(O8=SMALL((C8,F8,I8,L8,O8,R8),5),5,IF(O8=SMALL((C8,F8,I8,L8,O8,R8),6),6)))))))","v":1},{"$f":"IF(ISTEXT(P7),0,7-P7)","v":6},{"$f":"IF(ISERROR(FIND(\"Relay\", $B8)),  IF('Lane 1'!$C5=\"Swimmer\", \"\", 'Lane 1'!$C5), \"Relay\")","v":"Archie Hudson"},{"$f":"IF(OR(R8=\"DQ\",R8=\"DNS\"),\"-\",IF(R8=SMALL((C8,F8,I8,L8,O8,R8),1),1,IF(R8=SMALL((C8,F8,I8,L8,O8,R8),2),2,IF(R8=SMALL((C8,F8,I8,L8,O8,R8),3),3,IF(R8=SMALL((C8,F8,I8,L8,O8,R8),4),4,IF(R8=SMALL((C8,F8,I8,L8,O8,R8),5),5,IF(R8=SMALL((C8,F8,I8,L8,O8,R8),6),6)))))))","v":5},{"$f":"IF(ISTEXT(S7),0,7-S7)","v":2},{"$f":"T7+Q7+N7+K7+H7+E7","v":20}]
[null,"Freestyle","DQ",null,{"$f":"E6+E7","v":6},"00:00:42.150",null,{"$f":"H6+H7","v":8},"00:00:41.220",null,{"$f":"K6+K7","v":8},"00:00:40.750",null,{"$f":"N6+N7","v":7},"00:00:38.500",null,{"$f":"Q6+Q7","v":7},"00:00:44.400",null,{"$f":"T6+T7","v":5},null,{"$f":"V6+U7","v":41}]
[3,"G 9 yrs 1L",{"$f":"IF(ISERROR(FIND(\"Relay\", $B10)),  IF('Lane 2'!$C7=\"Swimmer\", \"\", 'Lane 2'!$C7), \"Relay\")","v":"Emilia Skelding"},{"$f":"IF(OR(C10=\"DQ\",C10=\"DNS\"),\"-\",IF(C10=SMALL((C10,F10,I10,L10,O10,R10),1),1,IF(C10=SMALL((C10,F10,I10,L10,O10,R10),2),2,IF(C10=SMALL((C10,F10,I10,L10,O10,R10),3),3,IF(C10=SMALL((C10,F10,I10,L10,O10,R10),4),4,IF(C10=SMALL((C10,F10,I10,L10,O10,R10),5),5,IF(C10=SMALL((C10,F10,I10,L10,O10,R10),6),6)))))))","v":1},{"$f":"IF(ISTEXT(D9),0,7-D9)","v":6},{"$f":"IF(ISERROR(FIND(\"Relay\", $B10)),  IF('Lane 3'!$C7=\"Swimmer\", \"\", 'Lane 3'!$C7), \"Relay\")","v":"Harriet Granahan"},{"$f":"IF(OR(F10=\"DQ\",F10=\"DNS\"),\"-\",IF(F10=SMALL((C10,F10,I10,L10,O10,R10),1),1,IF(F10=SMALL((C10,F10,I10,L10,O10,R10),2),2,IF(F10=SMALL((C10,F10,I10,L10,O10,R10),3),3,IF(F10=SMALL((C10,F10,I10,L10,O10,R10),4),4,IF(F10=SMALL((C10,F10,I10,L10,O10,R10),5),5,IF(F10=SMALL((C10,F10,I10,L10,O10,R10),6),6)))))))","v":5},{"$f":"IF(ISTEXT(G9),0,7-G9)","v":2},{"$f":"IF(ISERROR(FIND(\"Relay\", $B10)),  IF('Lane 4'!$C7=\"Swimmer\", \"\", 'Lane 4'!$C7), \"Relay\")","v":"Constance Gwillim"},{"$f":"IF(OR(I10=\"DQ\",I10=\"DNS\"),\"-\",IF(I10=SMALL((C10,F10,I10,L10,O10,R10),1),1,IF(I10=SMALL((C10,F10,I10,L10,O10,R10),2),2,IF(I10=SMALL((C10,F10,I10,L10,O10,R10),3),3,IF(I10=SMALL((C10,F10,I10,L10,O10,R10),4),4,IF(I10=SMALL((C10,F10,I10,L10,O10,R10),5),5,IF(I10=SMALL((C10,F10,I10,L10,O10,R10),6),6)))))))","v":2},{"$f":"IF(ISTEXT(J9),0,7-J9)","v":5},null,{"$f":"IF(OR(L10=\"DQ\",L10=\"DNS\"),\"-\",IF(L10=SMALL((C10,F10,I10,L10,O10,R10),1),1,IF(L10=SMALL((C10,F10,I10,L10,O10,R10),2),2,IF(L10=SMALL((C10,F10,I10,L10,O10,R10),3),3,IF(L10=SMALL((C10,F10,I10,L10,O10,R10),4),4,IF(L10=SMALL((C10,F10,I10,L10,O10,R10),5),5,IF(L10=SMALL((C10,F10,I10,L10,O10,R10),6),6)))))))","v":6},{"$f":"IF(ISTEXT(M9),0,7-M9)","v":1},{"$f":"IF(ISERROR(FIND(\"Relay\", $B10)),  IF('Lane 6'!$C7=\"Swimmer\", \"\", 'Lane 6'!$C7), \"Relay\")","v":"M Khera"},{"$f":"IF(OR(O10=\"DQ\",O10=\"DNS\"),\"-\",IF(O10=SMALL((C10,F10,I10,L10,O10,R10),1),1,IF(O10=SMALL((C10,F10,I10,L10,O10,R10),2),2,IF(O10=SMALL((C10,F10,I10,L10,O10,R10),3),3,IF(O10=SMALL((C10,F10,I10,L10,O10,R10),4),4,IF(O10=SMALL((C10,F10,I10,L10,O10,R10),5),5,IF(O10=SMALL((C10,F10,I10,L10,O10,R10),6),6)))))))","v":4},{"$f":"IF(ISTEXT(P9),0,7-P9)","v":3},{"$f":"IF(ISERROR(FIND(\"Relay\", $B10)),  IF('Lane 1'!$C7=\"Swimmer\", \"\", 'Lane 1'!$C7), \"Relay\")","v":"Abigail Bowater"},{"$f":"IF(OR(R10=\"DQ\",R10=\"DNS\"),\"-\",IF(R10=SMALL((C10,F10,I10,L10,O10,R10),1),1,IF(R10=SMALL((C10,F10,I10,L10,O10,R10),2),2,IF(R10=SMALL((C10,F10,I10,L10,O10,R10),3),3,IF(R10=SMALL((C10,F10,I10,L10,O10,R10),4),4,IF(R10=SMALL((C10,F10,I10,L10,O10,R10),5),5,IF(R10=SMALL((C10,F10,I10,L10,O10,R10),6),6)))))))","v":3},{"$f":"IF(ISTEXT(S9),0,7-S9)","v":4},{"$f":"T9+Q9+N9+K9+H9+E9","v":21}]
[null,"Breaststroke","00:00:24.670",null,{"$f":"E8+E9","v":12},"00:00:27.840",null,{"$f":"H8+H9","v":10},"00:00:26.480",null,{"$f":"K8+K9","v":13},"00:00:29.310",null,{"$f":"N8+N9","v":8},"00:00:27.560",null,{"$f":"Q8+Q9","v":10},"00:00:26.940",null,{"$f":"T8+T9","v":9},null,{"$f":"V8+U9","v":62}]
[4,"B 9 yrs 1L",{"$f":"IF(ISERROR(FIND(\"Relay\", $B12)),  IF('Lane 2'!$C9=\"Swimmer\", \"\", 'Lane 2'!$C9), \"Relay\")","v":"Christian Neal"},{"$f":"IF(OR(C12=\"DQ\",C12=\"DNS\"),\"-\",IF(C12=SMALL((C12,F12,I12,L12,O12,R12),1),1,IF(C12=SMALL((C12,F12,I12,L12,O12,R12),2),2,IF(C12=SMALL((C12,F12,I12,L12,O12,R12),3),3,IF(C12=SMALL((C12,F12,I12,L12,O12,R12),4),4,IF(C12=SMALL((C12,F12,I12,L12,O12,R12),5),5,IF(C12=SMALL((C12,F12,I12,L12,O12,R12),6),6)))))))","v":5},{"$f":"IF(ISTEXT(D11),0,7-D11)","v":2},{"$f":"IF(ISERROR(FIND(\"Relay\", $B12)),  IF('Lane 3'!$C9=\"Swimmer\", \"\", 'Lane 3'!$C9), \"Relay\")","v":"Harry Chruchley"},{"$f":"IF(OR(F12=\"DQ\",F12=\"DNS\"),\"-\",IF(F12=SMALL((C12,F12,I12,L12,O12,R12),1),1,IF(F12=SMALL((C12,F12,I12,L12,O12,R12),2),2,IF(F12=SMALL((C12,F12,I12,L12,O12,R12),3),3,IF(F12=SMALL((C12,F12,I12,L12,O12,R12),4),4,IF(F12=SMALL((C12,F12,I12,L12,O12,R12),5),5,IF(F12=SMALL((C12,F12,I12,L12,O12,R12),6),6)))))))","v":4},{"$f":"IF(ISTEXT(G11),0,7-G11)","v":3},{"$f":"IF(ISERROR(FIND(\"Relay\", $B12)),  IF('Lane 4'!$C9=\"Swimmer\", \"\", 'Lane 4'!$C9), \"Relay\")","v":"Ethan Ryan"},{"$f":"IF(OR(I12=\"DQ\",I12=\"DNS\"),\"-\",IF(I12=SMALL((C12,F12,I12,L12,O12,R12),1),1,IF(I12=SMALL((C12,F12,I12,L12,O12,R12),2),2,IF(I12=SMALL((C12,F12,I12,L12,O12,R12),3),3,IF(I12=SMALL((C12,F12,I12,L12,O12,R12),4),4,IF(I12=SMALL((C12,F12,I12,L12,O12,R12),5),5,IF(I12=SMALL((C12,F12,I12,L12,O12,R12),6),6)))))))","v":"-"},{"$f":"IF(ISTEXT(J11),0,7-J11)","v":0},{"$f":"IF(ISERROR(FIND(\"Relay\", $B12)),  IF('Lane 5'!$C9=\"Swimmer\", \"\", 'Lane 5'!$C9), \"Relay\")","v":"James Inshaw"},{"$f":"IF(OR(L12=\"DQ\",L12=\"DNS\"),\"-\",IF(L12=SMALL((C12,F12,I12,L12,O12,R12),1),1,IF(L12=SMALL((C12,F12,I12,L12,O12,R12),2),2,IF(L12=SMALL((C12,F12,I12,L12,O12,R12),3),3,IF(L12=SMALL((C12,F12,I12,L12,O12,R12),4),4,IF(L12=SMALL((C12,F12,I12,L12,O12,R12),5),5,IF(L12=SMALL((C12,F12,I12,L12,O12,R12),6),6)))))))","v":1},{"$f":"IF(ISTEXT(M11),0,7-M11)","v":6},{"$f":"IF(ISERROR(FIND(\"Relay\", $B12)),  IF('Lane 6'!$C9=\"Swimmer\", \"\", 'Lane 6'!$C9), \"Relay\")","v":"J Watson"},{"$f":"IF(OR(O12=\"DQ\",O12=\"DNS\"),\"-\",IF(O12=SMALL((C12,F12,I12,L12,O12,R12),1),1,IF(O12=SMALL((C12,F12,I12,L12,O12,R12),2),2,IF(O12=SMALL((C12,F12,I12,L12,O12,R12),3),3,IF(O12=SMALL((C12,F12,I12,L12,O12,R12),4),4,IF(O12=SMALL((C12,F12,I12,L12,O12,R12),5),5,IF(O12=SMALL((C12,F12,I12,L12,O12,R12),6),6)))))))","v":2},{"$f":"IF(ISTEXT(P11),0,7-P11)","v":5},{"$f":"IF(ISERROR(FIND(\"Relay\", $B12)),  IF('Lane 1'!$C9=\"Swimmer\", \"\", 'Lane 1'!$C9), \"Relay\")","v":"Leo Gamage"},{"$f":"IF(OR(R12=\"DQ\",R12=\"DNS\"),\"-\",IF(R12=SMALL((C12,F12,I12,L12,O12,R12),1),1,IF(R12=SMALL((C12,F12,I12,L12,O12,R12),2),2,IF(R12=SMALL((C12,F12,I12,L12,O12,R12),3),3,IF(R12=SMALL((C12,F12,I12,L12,O12,R12),4),4,IF(R12=SMALL((C12,F12,I12,L12,O12,R12),5),5,IF(R12=SMALL((C12,F12,I12,L12,O12,R12),6),6)))))))","v":3},{"$f":"IF(ISTEXT(S11),0,7-S11)","v":4},{"$f":"T11+Q11+N11+K11+H11+E11","v":20}]
[null,"Breaststroke","00:00:31.680",null,{"$f":"E10+E11","v":14},"00:00:28.760",null,{"$f":"H10+H11","v":13},"DQ",null,{"$f":"K10+K11","v":13},"00:00:23.190",null,{"$f":"N10+N11","v":14},"00:00:25.690",null,{"$f":"Q10+Q11","v":15},"00:00:28.460",null,{"$f":"T10+T11","v":13},null,{"$f":"V10+U11","v":82}]
[5,"G 11/u 4 x 1L ",{"$f":"IF(ISERROR(FIND(\"Relay\", $B14)),  IF('Lane 2'!$C11=\"Swimmer\", \"\", 'Lane 2'!$C11), \"Relay\")","v":"Relay"},{"$f":"IF(OR(C14=\"DQ\",C14=\"DNS\"),\"-\",IF(C14=SMALL((C14,F14,I14,L14,O14,R14),1),1,IF(C14=SMALL((C14,F14,I14,L14,O14,R14),2),2,IF(C14=SMALL((C14,F14,I14,L14,O14,R14),3),3,IF(C14=SMALL((C14,F14,I14,L14,O14,R14),4),4,IF(C14=SMALL((C14,F14,I14,L14,O14,R14),5),5,IF(C14=SMALL((C14,F14,I14,L14,O14,R14),6),6)))))))","v":4},{"$f":"IF(ISTEXT(D13),0,7-D13)","v":3},{"$f":"IF(ISERROR(FIND(\"Relay\", $B14)),  IF('Lane 3'!$C11=\"Swimmer\", \"\", 'Lane 3'!$C11), \"Relay\")","v":"Relay"},{"$f":"IF(OR(F14=\"DQ\",F14=\"DNS\"),\"-\",IF(F14=SMALL((C14,F14,I14,L14,O14,R14),1),1,IF(F14=SMALL((C14,F14,I14,L14,O14,R14),2),2,IF(F14=SMALL((C14,F14,I14,L14,O14,R14),3),3,IF(F14=SMALL((C14,F14,I14,L14,O14,R14),4),4,IF(F14=SMALL((C14,F14,I14,L14,O14,R14),5),5,IF(F14=SMALL((C14,F14,I14,L14,O14,R14),6),6)))))))","v":2},{"$f":"IF(ISTEXT(G13),0,7-G13)","v":5},{"$f":"IF(ISERROR(FIND(\"Relay\", $B14)),  IF('Lane 4'!$C11=\"Swimmer\", \"\", 'Lane 4'!$C11), \"Relay\")","v":"Relay"},{"$f":"IF(OR(I14=\"DQ\",I14=\"DNS\"),\"-\",IF(I14=SMALL((C14,F14,I14,L14,O14,R14),1),1,IF(I14=SMALL((C14,F14,I14,L14,O14,R14),2),2,IF(I14=SMALL((C14,F14,I14,L14,O14,R14),3),3,IF(I14=SMALL((C14,F14,I14,L14,O14,R14),4),4,IF(I14=SMALL((C14,F14,I14,L14,O14,R14),5),5,IF(I14=SMALL((C14,F14,I14,L14,O14,R14),6),6)))))))","v":3},{"$f":"IF(ISTEXT(J13),0,7-J13)","v":4},{"$f":"IF(ISERROR(FIND(\"Relay\", $B14)),  IF('Lane 5'!$C11=\"Swimmer\", \"\", 'Lane 5'!$C11), \"Relay\")","v":"Relay"},{"$f":"IF(OR(L14=\"DQ\",L14=\"DNS\"),\"-\",IF(L14=SMALL((C14,F14,I14,L14,O14,R14),1),1,IF(L14=SMALL((C14,F14,I14,L14,O14,R14),2),2,IF(L14=SMALL((C14,F14,I14,L14,O14,R14),3),3,IF(L14=SMALL((C14,F14,I14,L14,O14,R14),4),4,IF(L14=SMALL((C14,F14,I14,L14,O14,R14),5),5,IF(L14=SMALL((C14,F14,I14,L14,O14,R14),6),6)))))))","v":6},{"$f":"IF(ISTEXT(M13),0,7-M13)","v":1},{"$f":"IF(ISERROR(FIND(\"Relay\", $B14)),  IF('Lane 6'!$C11=\"Swimmer\", \"\", 'Lane 6'!$C11), \"Relay\")","v":"Relay"},{"$f":"IF(OR(O14=\"DQ\",O14=\"DNS\"),\"-\",IF(O14=SMALL((C14,F14,I14,L14,O14,R14),1),1,IF(O14=SMALL((C14,F14,I14,L14,O14,R14),2),2,IF(O14=SMALL((C14,F14,I14,L14,O14,R14),3),3,IF(O14=SMALL((C14,F14,I14,L14,O14,R14),4),4,IF(O14=SMALL((C14,F14,I14,L14,O14,R14),5),5,IF(O14=SMALL((C14,F14,I14,L14,O14,R14),6),6)))))))","v":1},{"$f":"IF(ISTEXT(P13),0,7-P13)","v":6},{"$f":"IF(ISERROR(FIND(\"Relay\", $B14)),  IF('Lane 1'!$D11=\"Swimmer\", \"\", 'Lane 1'!$D11), \"Relay\")","v":"Relay"},{"$f":"IF(OR(R14=\"DQ\",R14=\"DNS\"),\"-\",IF(R14=SMALL((C14,F14,I14,L14,O14,R14),1),1,IF(R14=SMALL((C14,F14,I14,L14,O14,R14),2),2,IF(R14=SMALL((C14,F14,I14,L14,O14,R14),3),3,IF(R14=SMALL((C14,F14,I14,L14,O14,R14),4),4,IF(R14=SMALL((C14,F14,I14,L14,O14,R14),5),5,IF(R14=SMALL((C14,F14,I14,L14,O14,R14),6),6)))))))","v":4},{"$f":"IF(ISTEXT(S13),0,7-S13)","v":3},{"$f":"T13+Q13+N13+K13+H13+E13","v":22}]
[null,"Medley Relay","00:01:29.990",null,{"$f":"E12+E13","v":17},"00:01:25.060",null,{"$f":"H12+H13","v":18},"00:01:29.380",null,{"$f":"K12+K13","v":17},"00:01:57.190",null,{"$f":"N12+N13","v":15},"00:01:24.400",null,{"$f":"Q12+Q13","v":21},"00:01:29.990",null,{"$f":"T12+T13","v":16},null,{"$f":"V12+U13","v":104}]
[6,"B 11/u 4 x 1L",{"$f":"IF(ISERROR(FIND(\"Relay\", $B16)),  IF('Lane 2'!$C13=\"Swimmer\", \"\", 'Lane 2'!$C13), \"Relay\")","v":"Relay"},{"$f":"IF(OR(C16=\"DQ\",C16=\"DNS\"),\"-\",IF(C16=SMALL((C16,F16,I16,L16,O16,R16),1),1,IF(C16=SMALL((C16,F16,I16,L16,O16,R16),2),2,IF(C16=SMALL((C16,F16,I16,L16,O16,R16),3),3,IF(C16=SMALL((C16,F16,I16,L16,O16,R16),4),4,IF(C16=SMALL((C16,F16,I16,L16,O16,R16),5),5,IF(C16=SMALL((C16,F16,I16,L16,O16,R16),6),6)))))))","v":"-"},{"$f":"IF(ISTEXT(D15),0,7-D15)","v":0},{"$f":"IF(ISERROR(FIND(\"Relay\", $B16)),  IF('Lane 3'!$C13=\"Swimmer\", \"\", 'Lane 3'!$C13), \"Relay\")","v":"Relay"},{"$f":"IF(OR(F16=\"DQ\",F16=\"DNS\"),\"-\",IF(F16=SMALL((C16,F16,I16,L16,O16,R16),1),1,IF(F16=SMALL((C16,F16,I16,L16,O16,R16),2),2,IF(F16=SMALL((C16,F16,I16,L16,O16,R16),3),3,IF(F16=SMALL((C16,F16,I16,L16,O16,R16),4),4,IF(F16=SMALL((C16,F16,I16,L16,O16,R16),5),5,IF(F16=SMALL((C16,F16,I16,L16,O16,R16),6),6)))))))","v":1},{"$f":"IF(ISTEXT(G15),0,7-G15)","v":6},{"$f":"IF(ISERROR(FIND(\"Relay\", $B16)),  IF('Lane 4'!$C13=\"Swimmer\", \"\", 'Lane 4'!$C13), \"Relay\")","v":"Relay"},{"$f":"IF(OR(I16=\"DQ\",I16=\"DNS\"),\"-\",IF(I16=SMALL((C16,F16,I16,L16,O16,R16),1),1,IF(I16=SMALL((C16,F16,I16,L16,O16,R16),2),2,IF(I16=SMALL((C16,F16,I16,L16,O16,R16),3),3,IF(I16=SMALL((C16,F16,I16,L16,O16,R16),4),4,IF(I16=SMALL((C16,F16,I16,L16,O16,R16),5),5,IF(I16=SMALL((C16,F16,I16,L16,O16,R16),6),6)))))))","v":5},{"$f":"IF(ISTEXT(J15),0,7-J15)","v":2},{"$f":"IF(ISERROR(FIND(\"Relay\", $B16)),  IF('Lane 5'!$C13=\"Swimmer\", \"\", 'Lane 5'!$C13), \"Relay\")","v":"Relay"},{"$f":"IF(OR(L16=\"DQ\",L16=\"DNS\"),\"-\",IF(L16=SMALL((C16,F16,I16,L16,O16,R16),1),1,IF(L16=SMALL((C16,F16,I16,L16,O16,R16),2),2,IF(L16=SMALL((C16,F16,I16,L16,O16,R16),3),3,IF(L16=SMALL((C16,F16,I16,L16,O16,R16),4),4,IF(L16=SMALL((C16,F16,I16,L16,O16,R16),5),5,IF(L16=SMALL((C16,F16,I16,L16,O16,R16),6),6)))))))","v":4},{"$f":"IF(ISTEXT(M15),0,7-M15)","v":3},{"$f":"IF(ISERROR(FIND(\"Relay\", $B16)),  IF('Lane 6'!$C13=\"Swimmer\", \"\", 'Lane 6'!$C13), \"Relay\")","v":"Relay"},{"$f":"IF(OR(O16=\"DQ\",O16=\"DNS\"),\"-\",IF(O16=SMALL((C16,F16,I16,L16,O16,R16),1),1,IF(O16=SMALL((C16,F16,I16,L16,O16,R16),2),2,IF(O16=SMALL((C16,F16,I16,L16,O16,R16),3),3,IF(O16=SMALL((C16,F16,I16,L16,O16,R16),4),4,IF(O16=SMALL((C16,F16,I16,L16,O16,R16),5),5,IF(O16=SMALL((C16,F16,I16,L16,O16,R16),6),6)))))))","v":3},{"$f":"IF(ISTEXT(P15),0,7-P15)","v":4},{"$f":"IF(ISERROR(FIND(\"Relay\", $B16)),  IF('Lane 1'!$D13=\"Swimmer\", \"\", 'Lane 1'!$D13), \"Relay\")","v":"Relay"},{"$f":"IF(OR(R16=\"DQ\",R16=\"DNS\"),\"-\",IF(R16=SMALL((C16,F16,I16,L16,O16,R16),1),1,IF(R16=SMALL((C16,F16,I16,L16,O16,R16),2),2,IF(R16=SMALL((C16,F16,I16,L16,O16,R16),3),3,IF(R16=SMALL((C16,F16,I16,L16,O16,R16),4),4,IF(R16=SMALL((C16,F16,I16,L16,O16,R16),5),5,IF(R16=SMALL((C16,F16,I16,L16,O16,R16),6),6)))))))","v":2},{"$f":"IF(ISTEXT(S15),0,7-S15)","v":5},{"$f":"T15+Q15+N15+K15+H15+E15","v":20}]
[null,"Medley Relay","DQ",null,{"$f":"E14+E15","v":17},"00:01:16.740",null,{"$f":"H14+H15","v":24},"00:01:25.340",null,{"$f":"K14+K15","v":19},"00:01:22.380",null,{"$f":"N14+N15","v":18},"00:01:17.530",null,{"$f":"Q14+Q15","v":25},"00:01:17.410",null,{"$f":"T14+T15","v":21},null,{"$f":"V14+U15","v":124}]
[7,"G 12/u 2L",{"$f":"IF(ISERROR(FIND(\"Relay\", $B18)),  IF('Lane 2'!$C15=\"Swimmer\", \"\", 'Lane 2'!$C15), \"Relay\")","v":"Jessica Adcock"},{"$f":"IF(OR(C18=\"DQ\",C18=\"DNS\"),\"-\",IF(C18=SMALL((C18,F18,I18,L18,O18,R18),1),1,IF(C18=SMALL((C18,F18,I18,L18,O18,R18),2),2,IF(C18=SMALL((C18,F18,I18,L18,O18,R18),3),3,IF(C18=SMALL((C18,F18,I18,L18,O18,R18),4),4,IF(C18=SMALL((C18,F18,I18,L18,O18,R18),5),5,IF(C18=SMALL((C18,F18,I18,L18,O18,R18),6),6)))))))","v":3},{"$f":"IF(ISTEXT(D17),0,7-D17)","v":4},{"$f":"IF(ISERROR(FIND(\"Relay\", $B18)),  IF('Lane 3'!$C15=\"Swimmer\", \"\", 'Lane 3'!$C15), \"Relay\")","v":"Ellie Chater"},{"$f":"IF(OR(F18=\"DQ\",F18=\"DNS\"),\"-\",IF(F18=SMALL((C18,F18,I18,L18,O18,R18),1),1,IF(F18=SMALL((C18,F18,I18,L18,O18,R18),2),2,IF(F18=SMALL((C18,F18,I18,L18,O18,R18),3),3,IF(F18=SMALL((C18,F18,I18,L18,O18,R18),4),4,IF(F18=SMALL((C18,F18,I18,L18,O18,R18),5),5,IF(F18=SMALL((C18,F18,I18,L18,O18,R18),6),6)))))))","v":4},{"$f":"IF(ISTEXT(G17),0,7-G17)","v":3},{"$f":"IF(ISERROR(FIND(\"Relay\", $B18)),  IF('Lane 4'!$C15=\"Swimmer\", \"\", 'Lane 4'!$C15), \"Relay\")","v":"Erin Irving"},{"$f":"IF(OR(I18=\"DQ\",I18=\"DNS\"),\"-\",IF(I18=SMALL((C18,F18,I18,L18,O18,R18),1),1,IF(I18=SMALL((C18,F18,I18,L18,O18,R18),2),2,IF(I18=SMALL((C18,F18,I18,L18,O18,R18),3),3,IF(I18=SMALL((C18,F18,I18,L18,O18,R18),4),4,IF(I18=SMALL((C18,F18,I18,L18,O18,R18),5),5,IF(I18=SMALL((C18,F18,I18,L18,O18,R18),6),6)))))))","v":5},{"$f":"IF(ISTEXT(J17),0,7-J17)","v":2},{"$f":"IF(ISERROR(FIND(\"Relay\", $B18)),  IF('Lane 5'!$C15=\"Swimmer\", \"\", 'Lane 5'!$C15), \"Relay\")","v":"AJ Finch"},{"$f":"IF(OR(L18=\"DQ\",L18=\"DNS\"),\"-\",IF(L18=SMALL((C18,F18,I18,L18,O18,R18),1),1,IF(L18=SMALL((C18,F18,I18,L18,O18,R18),2),2,IF(L18=SMALL((C18,F18,I18,L18,O18,R18),3),3,IF(L18=SMALL((C18,F18,I18,L18,O18,R18),4),4,IF(L18=SMALL((C18,F18,I18,L18,O18,R18),5),5,IF(L18=SMALL((C18,F18,I18,L18,O18,R18),6),6)))))))","v":2},{"$f":"IF(ISTEXT(M17),0,7-M17)","v":5},{"$f":"IF(ISERROR(FIND(\"Relay\", $B18)),  IF('Lane 6'!$C15=\"Swimmer\", \"\", 'Lane 6'!$C15), \"Relay\")","v":"R Powell"},{"$f":"IF(OR(O18=\"DQ\",O18=\"DNS\"),\"-\",IF(O18=SMALL((C18,F18,I18,L18,O18,R18),1),1,IF(O18=SMALL((C18,F18,I18,L18,O18,R18),2),2,IF(O18=SMALL((C18,F18,I18,L18,O18,R18),3),3,IF(O18=SMALL((C18,F18,I18,L18,O18,R18),4),4,IF(O18=SMALL((C18,F18,I18,L18,O18,R18),5),5,IF(O18=SMALL((C18,F18,I18,L18,O18,R18),6),6)))))))","v":6},{"$f":"IF(ISTEXT(P17),0,7-P17)","v":1},{"$f":"IF(ISERROR(FIND(\"Relay\", $B18)),  IF('Lane 1'!$C15=\"Swimmer\", \"\", 'Lane 1'!$C15), \"Relay\")","v":"Esther Cunniffe"},{"$f":"IF(OR(R18=\"DQ\",R18=\"DNS\"),\"-\",IF(R18=SMALL((C18,F18,I18,L18,O18,R18),1),1,IF(R18=SMALL((C18,F18,I18,L18,O18,R18),2),2,IF(R18=SMALL((C18,F18,I18,L18,O18,R18),3),3,IF(R18=SMALL((C18,F18,I18,L18,O18,R18),4),4,IF(R18=SMALL((C18,F18,I18,L18,O18,R18),5),5,IF(R18=SMALL((C18,F18,I18,L18,O18,R18),6),6)))))))","v":1},{"$f":"IF(ISTEXT(S17),0,7-S17)","v":6},{"$f":"T17+Q17+N17+K17+H17+E17","v":21}]
[null,"Backstroke","00:00:41.150",null,{"$f":"E16+E17","v":21},"00:00:41.720",null,{"$f":"H16+H17","v":27},"00:00:42.300",null,{"$f":"K16+K17","v":21},"00:00:39.880",null,{"$f":"N16+N17","v":23},"00:00:44.910",null,{"$f":"Q16+Q17","v":26},"00:00:39.190",null,{"$f":"T16+T17","v":27},null,{"$f":"V16+U17","v":145}]
[8,"B 12/u 2L ",{"$f":"IF(ISERROR(FIND(\"Relay\", $B20)),  IF('Lane 2'!$C17=\"Swimmer\", \"\", 'Lane 2'!$C17), \"Relay\")","v":"Alex Walker"},{"$f":"IF(OR(C20=\"DQ\",C20=\"DNS\"),\"-\",IF(C20=SMALL((C20,F20,I20,L20,O20,R20),1),1,IF(C20=SMALL((C20,F20,I20,L20,O20,R20),2),2,IF(C20=SMALL((C20,F20,I20,L20,O20,R20),3),3,IF(C20=SMALL((C20,F20,I20,L20,O20,R20),4),4,IF(C20=SMALL((C20,F20,I20,L20,O20,R20),5),5,IF(C20=SMALL((C20,F20,I20,L20,O20,R20),6),6)))))))","v":1},{"$f":"IF(ISTEXT(D19),0,7-D19)","v":6},{"$f":"IF(ISERROR(FIND(\"Relay\", $B20)),  IF('Lane 3'!$C17=\"Swimmer\", \"\", 'Lane 3'!$C17), \"Relay\")","v":"Sam Nicholson"},{"$f":"IF(OR(F20=\"DQ\",F20=\"DNS\"),\"-\",IF(F20=SMALL((C20,F20,I20,L20,O20,R20),1),1,IF(F20=SMALL((C20,F20,I20,L20,O20,R20),2),2,IF(F20=SMALL((C20,F20,I20,L20,O20,R20),3),3,IF(F20=SMALL((C20,F20,I20,L20,O20,R20),4),4,IF(F20=SMALL((C20,F20,I20,L20,O20,R20),5),5,IF(F20=SMALL((C20,F20,I20,L20,O20,R20),6),6)))))))","v":3},{"$f":"IF(ISTEXT(G19),0,7-G19)","v":4},{"$f":"IF(ISERROR(FIND(\"Relay\", $B20)),  IF('Lane 4'!$C17=\"Swimmer\", \"\", 'Lane 4'!$C17), \"Relay\")","v":"Thomas Collerhan"},{"$f":"IF(OR(I20=\"DQ\",I20=\"DNS\"),\"-\",IF(I20=SMALL((C20,F20,I20,L20,O20,R20),1),1,IF(I20=SMALL((C20,F20,I20,L20,O20,R20),2),2,IF(I20=SMALL((C20,F20,I20,L20,O20,R20),3),3,IF(I20=SMALL((C20,F20,I20,L20,O20,R20),4),4,IF(I20=SMALL((C20,F20,I20,L20,O20,R20),5),5,IF(I20=SMALL((C20,F20,I20,L20,O20,R20),6),6)))))))","v":2},{"$f":"IF(ISTEXT(J19),0,7-J19)","v":5},{"$f":"IF(ISERROR(FIND(\"Relay\", $B20)),  IF('Lane 5'!$C17=\"Swimmer\", \"\", 'Lane 5'!$C17), \"Relay\")","v":"Michael Bushael"},{"$f":"IF(OR(L20=\"DQ\",L20=\"DNS\"),\"-\",IF(L20=SMALL((C20,F20,I20,L20,O20,R20),1),1,IF(L20=SMALL((C20,F20,I20,L20,O20,R20),2),2,IF(L20=SMALL((C20,F20,I20,L20,O20,R20),3),3,IF(L20=SMALL((C20,F20,I20,L20,O20,R20),4),4,IF(L20=SMALL((C20,F20,I20,L20,O20,R20),5),5,IF(L20=SMALL((C20,F20,I20,L20,O20,R20),6),6)))))))","v":6},{"$f":"IF(ISTEXT(M19),0,7-M19)","v":1},{"$f":"IF(ISERROR(FIND(\"Relay\", $B20)),  IF('Lane 6'!$C17=\"Swimmer\", \"\", 'Lane 6'!$C17), \"Relay\")","v":"H Bottrill"},{"$f":"IF(OR(O20=\"DQ\",O20=\"DNS\"),\"-\",IF(O20=SMALL((C20,F20,I20,L20,O20,R20),1),1,IF(O20=SMALL((C20,F20,I20,L20,O20,R20),2),2,IF(O20=SMALL((C20,F20,I20,L20,O20,R20),3),3,IF(O20=SMALL((C20,F20,I20,L20,O20,R20),4),4,IF(O20=SMALL((C20,F20,I20,L20,O20,R20),5),5,IF(O20=SMALL((C20,F20,I20,L20,O20,R20),6),6)))))))","v":4},{"$f":"IF(ISTEXT(P19),0,7-P19)","v":3},{"$f":"IF(ISERROR(FIND(\"Relay\", $B20)),  IF('Lane 1'!$C17=\"Swimmer\", \"\", 'Lane 1'!$C17), \"Relay\")","v":"Adam Whitehouse"},{"$f":"IF(OR(R20=\"DQ\",R20=\"DNS\"),\"-\",IF(R20=SMALL((C20,F20,I20,L20,O20,R20),1),1,IF(R20=SMALL((C20,F20,I20,L20,O20,R20),2),2,IF(R20=SMALL((C20,F20,I20,L20,O20,R20),3),3,IF(R20=SMALL((C20,F20,I20,L20,O20,R20),4),4,IF(R20=SMALL((C20,F20,I20,L20,O20,R20),5),5,IF(R20=SMALL((C20,F20,I20,L20,O20,R20),6),6)))))))","v":5},{"$f":"IF(ISTEXT(S19),0,7-S19)","v":2},{"$f":"T19+Q19+N19+K19+H19+E19","v":21}]
[null,"Backstroke","00:00:39.540",null,{"$f":"E18+E19","v":27},"00:00:43.380",null,{"$f":"H18+H19","v":31},"00:00:40.650",null,{"$f":"K18+K19","v":26},"00:00:47.250",null,{"$f":"N18+N19","v":24},"00:00:44.380",null,{"$f":"Q18+Q19","v":29},"00:00:45.810",null,{"$f":"T18+T19","v":29},null,{"$f":"V18+U19","v":166}]
[9,"G 10/u 2L",{"$f":"IF(ISERROR(FIND(\"Relay\", $B22)),  IF('Lane 2'!$C19=\"Swimmer\", \"\", 'Lane 2'!$C19), \"Relay\")","v":"Amber Valletta"},{"$f":"IF(OR(C22=\"DQ\",C22=\"DNS\"),\"-\",IF(C22=SMALL((C22,F22,I22,L22,O22,R22),1),1,IF(C22=SMALL((C22,F22,I22,L22,O22,R22),2),2,IF(C22=SMALL((C22,F22,I22,L22,O22,R22),3),3,IF(C22=SMALL((C22,F22,I22,L22,O22,R22),4),4,IF(C22=SMALL((C22,F22,I22,L22,O22,R22),5),5,IF(C22=SMALL((C22,F22,I22,L22,O22,R22),6),6)))))))","v":1},{"$f":"IF(ISTEXT(D21),0,7-D21)","v":6},{"$f":"IF(ISERROR(FIND(\"Relay\", $B22)),  IF('Lane 3'!$C19=\"Swimmer\", \"\", 'Lane 3'!$C19), \"Relay\")","v":"Izzie Wilkinson"},{"$f":"IF(OR(F22=\"DQ\",F22=\"DNS\"),\"-\",IF(F22=SMALL((C22,F22,I22,L22,O22,R22),1),1,IF(F22=SMALL((C22,F22,I22,L22,O22,R22),2),2,IF(F22=SMALL((C22,F22,I22,L22,O22,R22),3),3,IF(F22=SMALL((C22,F22,I22,L22,O22,R22),4),4,IF(F22=SMALL((C22,F22,I22,L22,O22,R22),5),5,IF(F22=SMALL((C22,F22,I22,L22,O22,R22),6),6)))))))","v":3},{"$f":"IF(ISTEXT(G21),0,7-G21)","v":4},{"$f":"IF(ISERROR(FIND(\"Relay\", $B22)),  IF('Lane 4'!$C19=\"Swimmer\", \"\", 'Lane 4'!$C19), \"Relay\")","v":"Ayla Goucher"},{"$f":"IF(OR(I22=\"DQ\",I22=\"DNS\"),\"-\",IF(I22=SMALL((C22,F22,I22,L22,O22,R22),1),1,IF(I22=SMALL((C22,F22,I22,L22,O22,R22),2),2,IF(I22=SMALL((C22,F22,I22,L22,O22,R22),3),3,IF(I22=SMALL((C22,F22,I22,L22,O22,R22),4),4,IF(I22=SMALL((C22,F22,I22,L22,O22,R22),5),5,IF(I22=SMALL((C22,F22,I22,L22,O22,R22),6),6)))))))","v":2},{"$f":"IF(ISTEXT(J21),0,7-J21)","v":5},{"$f":"IF(ISERROR(FIND(\"Relay\", $B22)),  IF('Lane 5'!$C19=\"Swimmer\", \"\", 'Lane 5'!$C19), \"Relay\")","v":"Neveah Choudhury"},{"$f":"IF(OR(L22=\"DQ\",L22=\"DNS\"),\"-\",IF(L22=SMALL((C22,F22,I22,L22,O22,R22),1),1,IF(L22=SMALL((C22,F22,I22,L22,O22,R22),2),2,IF(L22=SMALL((C22,F22,I22,L22,O22,R22),3),3,IF(L22=SMALL((C22,F22,I22,L22,O22,R22),4),4,IF(L22=SMALL((C22,F22,I22,L22,O22,R22),5),5,IF(L22=SMALL((C22,F22,I22,L22,O22,R22),6),6)))))))","v":6},{"$f":"IF(ISTEXT(M21),0,7-M21)","v":1},{"$f":"IF(ISERROR(FIND(\"Relay\", $B22)),  IF('Lane 6'!$C19=\"Swimmer\", \"\", 'Lane 6'!$C19), \"Relay\")","v":"M Khera"},{"$f":"IF(OR(O22=\"DQ\",O22=\"DNS\"),\"-\",IF(O22=SMALL((C22,F22,I22,L22,O22,R22),1),1,IF(O22=SMALL((C22,F22,I22,L22,O22,R22),2),2,IF(O22=SMALL((C22,F22,I22,L22,O22,R22),3),3,IF(O22=SMALL((C22,F22,I22,L22,O22,R22),4),4,IF(O22=SMALL((C22,F22,I22,L22,O22,R22),5),5,IF(O22=SMALL((C22,F22,I22,L22,O22,R22),6),6)))))))","v":5},{"$f":"IF(ISTEXT(P21),0,7-P21)","v":2},{"$f":"IF(ISERROR(FIND(\"Relay\", $B22)),  IF('Lane 1'!$C19=\"Swimmer\", \"\", 'Lane 1'!$C19), \"Relay\")","v":"Scarlett Fletcher"},{"$f":"IF(OR(R22=\"DQ\",R22=\"DNS\"),\"-\",IF(R22=SMALL((C22,F22,I22,L22,O22,R22),1),1,IF(R22=SMALL((C22,F22,I22,L22,O22,R22),2),2,IF(R22=SMALL((C22,F22,I22,L22,O22,R22),3),3,IF(R22=SMALL((C22,F22,I22,L22,O22,R22),4),4,IF(R22=SMALL((C22,F22,I22,L22,O22,R22),5),5,IF(R22=SMALL((C22,F22,I22,L22,O22,R22),6),6)))))))","v":4},{"$f":"IF(ISTEXT(S21),0,7-S21)","v":3},{"$f":"T21+Q21+N21+K21+H21+E21","v":21}]
[null,"Breaststroke","00:00:49.470",null,{"$f":"E20+E21","v":33},"00:00:55.080",null,{"$f":"H20+H21","v":35},"00:00:53.330",null,{"$f":"K20+K21","v":31},"00:01:03.440",null,{"$f":"N20+N21","v":25},"00:01:02.160",null,{"$f":"Q20+Q21","v":31},"00:00:55.720",null,{"$f":"T20+T21","v":32},null,{"$f":"V20+U21","v":187}]
[10,"B 10/u 2L",{"$f":"IF(ISERROR(FIND(\"Relay\", $B24)),  IF('Lane 2'!$C21=\"Swimmer\", \"\", 'Lane 2'!$C21), \"Relay\")","v":"Adam Walker"},{"$f":"IF(OR(C24=\"DQ\",C24=\"DNS\"),\"-\",IF(C24=SMALL((C24,F24,I24,L24,O24,R24),1),1,IF(C24=SMALL((C24,F24,I24,L24,O24,R24),2),2,IF(C24=SMALL((C24,F24,I24,L24,O24,R24),3),3,IF(C24=SMALL((C24,F24,I24,L24,O24,R24),4),4,IF(C24=SMALL((C24,F24,I24,L24,O24,R24),5),5,IF(C24=SMALL((C24,F24,I24,L24,O24,R24),6),6)))))))","v":6},{"$f":"IF(ISTEXT(D23),0,7-D23)","v":1},{"$f":"IF(ISERROR(FIND(\"Relay\", $B24)),  IF('Lane 3'!$C21=\"Swimmer\", \"\", 'Lane 3'!$C21), \"Relay\")","v":"Charlie Hodgetts"},{"$f":"IF(OR(F24=\"DQ\",F24=\"DNS\"),\"-\",IF(F24=SMALL((C24,F24,I24,L24,O24,R24),1),1,IF(F24=SMALL((C24,F24,I24,L24,O24,R24),2),2,IF(F24=SMALL((C24,F24,I24,L24,O24,R24),3),3,IF(F24=SMALL((C24,F24,I24,L24,O24,R24),4),4,IF(F24=SMALL((C24,F24,I24,L24,O24,R24),5),5,IF(F24=SMALL((C24,F24,I24,L24,O24,R24),6),6)))))))","v":1},{"$f":"IF(ISTEXT(G23),0,7-G23)","v":6},{"$f":"IF(ISERROR(FIND(\"Relay\", $B24)),  IF('Lane 4'!$C21=\"Swimmer\", \"\", 'Lane 4'!$C21), \"Relay\")","v":"Keiran O'Reilly"},{"$f":"IF(OR(I24=\"DQ\",I24=\"DNS\"),\"-\",IF(I24=SMALL((C24,F24,I24,L24,O24,R24),1),1,IF(I24=SMALL((C24,F24,I24,L24,O24,R24),2),2,IF(I24=SMALL((C24,F24,I24,L24,O24,R24),3),3,IF(I24=SMALL((C24,F24,I24,L24,O24,R24),4),4,IF(I24=SMALL((C24,F24,I24,L24,O24,R24),5),5,IF(I24=SMALL((C24,F24,I24,L24,O24,R24),6),6)))))))","v":2},{"$f":"IF(ISTEXT(J23),0,7-J23)","v":5},{"$f":"IF(ISERROR(FIND(\"Relay\", $B24)),  IF('Lane 5'!$C21=\"Swimmer\", \"\", 'Lane 5'!$C21), \"Relay\")","v":"Joe Box"},{"$f":"IF(OR(L24=\"DQ\",L24=\"DNS\"),\"-\",IF(L24=SMALL((C24,F24,I24,L24,O24,R24),1),1,IF(L24=SMALL((C24,F24,I24,L24,O24,R24),2),2,IF(L24=SMALL((C24,F24,I24,L24,O24,R24),3),3,IF(L24=SMALL((C24,F24,I24,L24,O24,R24),4),4,IF(L24=SMALL((C24,F24,I24,L24,O24,R24),5),5,IF(L24=SMALL((C24,F24,I24,L24,O24,R24),6),6)))))))","v":3},{"$f":"IF(ISTEXT(M23),0,7-M23)","v":4},{"$f":"IF(ISERROR(FIND(\"Relay\", $B24)),  IF('Lane 6'!$C21=\"Swimmer\", \"\", 'Lane 6'!$C21), \"Relay\")","v":"W Bottrill"},{"$f":"IF(OR(O24=\"DQ\",O24=\"DNS\"),\"-\",IF(O24=SMALL((C24,F24,I24,L24,O24,R24),1),1,IF(O24=SMALL((C24,F24,I24,L24,O24,R24),2),2,IF(O24=SMALL((C24,F24,I24,L24,O24,R24),3),3,IF(O24=SMALL((C24,F24,I24,L24,O24,R24),4),4,IF(O24=SMALL((C24,F24,I24,L24,O24,R24),5),5,IF(O24=SMALL((C24,F24,I24,L24,O24,R24),6),6)))))))","v":4},{"$f":"IF(ISTEXT(P23),0,7-P23)","v":3},{"$f":"IF(ISERROR(FIND(\"Relay\", $B24)),  IF('Lane 1'!$C21=\"Swimmer\", \"\", 'Lane 1'!$C21), \"Relay\")","v":"Musa Yusopov"},{"$f":"IF(OR(R24=\"DQ\",R24=\"DNS\"),\"-\",IF(R24=SMALL((C24,F24,I24,L24,O24,R24),1),1,IF(R24=SMALL((C24,F24,I24,L24,O24,R24),2),2,IF(R24=SMALL((C24,F24,I24,L24,O24,R24),3),3,IF(R24=SMALL((C24,F24,I24,L24,O24,R24),4),4,IF(R24=SMALL((C24,F24,I24,L24,O24,R24),5),5,IF(R24=SMALL((C24,F24,I24,L24,O24,R24),6),6)))))))","v":5},{"$f":"IF(ISTEXT(S23),0,7-S23)","v":2},{"$f":"T23+Q23+N23+K23+H23+E23","v":21}]
[null,"Breaststroke","00:00:58.590",null,{"$f":"E22+E23","v":34},"00:00:46.710",null,{"$f":"H22+H23","v":41},"00:00:49.070",null,{"$f":"K22+K23","v":36},"00:00:49.370",null,{"$f":"N22+N23","v":29},"00:00:53.880",null,{"$f":"Q22+Q23","v":34},"00:00:58.570",null,{"$f":"T22+T23","v":34},null,{"$f":"V22+U23","v":208}]
[11,"G 9 yrs 4 x 1L",{"$f":"IF(ISERROR(FIND(\"Relay\", $B26)),  IF('Lane 2'!$C23=\"Swimmer\", \"\", 'Lane 2'!$C23), \"Relay\")","v":"Relay"},{"$f":"IF(OR(C26=\"DQ\",C26=\"DNS\"),\"-\",IF(C26=SMALL((C26,F26,I26,L26,O26,R26),1),1,IF(C26=SMALL((C26,F26,I26,L26,O26,R26),2),2,IF(C26=SMALL((C26,F26,I26,L26,O26,R26),3),3,IF(C26=SMALL((C26,F26,I26,L26,O26,R26),4),4,IF(C26=SMALL((C26,F26,I26,L26,O26,R26),5),5,IF(C26=SMALL((C26,F26,I26,L26,O26,R26),6),6)))))))","v":2},{"$f":"IF(ISTEXT(D25),0,7-D25)","v":5},{"$f":"IF(ISERROR(FIND(\"Relay\", $B26)),  IF('Lane 3'!$C23=\"Swimmer\", \"\", 'Lane 3'!$C23), \"Relay\")","v":"Relay"},{"$f":"IF(OR(F26=\"DQ\",F26=\"DNS\"),\"-\",IF(F26=SMALL((C26,F26,I26,L26,O26,R26),1),1,IF(F26=SMALL((C26,F26,I26,L26,O26,R26),2),2,IF(F26=SMALL((C26,F26,I26,L26,O26,R26),3),3,IF(F26=SMALL((C26,F26,I26,L26,O26,R26),4),4,IF(F26=SMALL((C26,F26,I26,L26,O26,R26),5),5,IF(F26=SMALL((C26,F26,I26,L26,O26,R26),6),6)))))))","v":"-"},{"$f":"IF(ISTEXT(G25),0,7-G25)","v":0},{"$f":"IF(ISERROR(FIND(\"Relay\", $B26)),  IF('Lane 4'!$C23=\"Swimmer\", \"\", 'Lane 4'!$C23), \"Relay\")","v":"Relay"},{"$f":"IF(OR(I26=\"DQ\",I26=\"DNS\"),\"-\",IF(I26=SMALL((C26,F26,I26,L26,O26,R26),1),1,IF(I26=SMALL((C26,F26,I26,L26,O26,R26),2),2,IF(I26=SMALL((C26,F26,I26,L26,O26,R26),3),3,IF(I26=SMALL((C26,F26,I26,L26,O26,R26),4),4,IF(I26=SMALL((C26,F26,I26,L26,O26,R26),5),5,IF(I26=SMALL((C26,F26,I26,L26,O26,R26),6),6)))))))","v":"-"},{"$f":"IF(ISTEXT(J25),0,7-J25)","v":0},{"$f":"IF(ISERROR(FIND(\"Relay\", $B26)),  IF('Lane 5'!$C23=\"Swimmer\", \"\", 'Lane 5'!$C23), \"Relay\")","v":"Relay"},{"$f":"IF(OR(L26=\"DQ\",L26=\"DNS\"),\"-\",IF(L26=SMALL((C26,F26,I26,L26,O26,R26),1),1,IF(L26=SMALL((C26,F26,I26,L26,O26,R26),2),2,IF(L26=SMALL((C26,F26,I26,L26,O26,R26),3),3,IF(L26=SMALL((C26,F26,I26,L26,O26,R26),4),4,IF(L26=SMALL((C26,F26,I26,L26,O26,R26),5),5,IF(L26=SMALL((C26,F26,I26,L26,O26,R26),6),6)))))))","v":"-"},{"$f":"IF(ISTEXT(M25),0,7-M25)","v":0},{"$f":"IF(ISERROR(FIND(\"Relay\", $B26)),  IF('Lane 6'!$C23=\"Swimmer\", \"\", 'Lane 6'!$C23), \"Relay\")","v":"Relay"},{"$f":"IF(OR(O26=\"DQ\",O26=\"DNS\"),\"-\",IF(O26=SMALL((C26,F26,I26,L26,O26,R26),1),1,IF(O26=SMALL((C26,F26,I26,L26,O26,R26),2),2,IF(O26=SMALL((C26,F26,I26,L26,O26,R26),3),3,IF(O26=SMALL((C26,F26,I26,L26,O26,R26),4),4,IF(O26=SMALL((C26,F26,I26,L26,O26,R26),5),5,IF(O26=SMALL((C26,F26,I26,L26,O26,R26),6),6)))))))","v":3},{"$f":"IF(ISTEXT(P25),0,7-P25)","v":4},{"$f":"IF(ISERROR(FIND(\"Relay\", $B26)),  IF('Lane 1'!$D23=\"Swimmer\", \"\", 'Lane 1'!$D23), \"Relay\")","v":"Relay"},{"$f":"IF(OR(R26=\"DQ\",R26=\"DNS\"),\"-\",IF(R26=SMALL((C26,F26,I26,L26,O26,R26),1),1,IF(R26=SMALL((C26,F26,I26,L26,O26,R26),2),2,IF(R26=SMALL((C26,F26,I26,L26,O26,R26),3),3,IF(R26=SMALL((C26,F26,I26,L26,O26,R26),4),4,IF(R26=SMALL((C26,F26,I26,L26,O26,R26),5),5,IF(R26=SMALL((C26,F26,I26,L26,O26,R26),6),6)))))))","v":1},{"$f":"IF(ISTEXT(S25),0,7-S25)","v":6},{"$f":"T25+Q25+N25+K25+H25+E25","v":15}]
[null,"Medley Relay","00:01:43.410",null,{"$f":"E24+E25","v":39},"DQ",null,{"$f":"H24+H25","v":41},"DQ",null,{"$f":"K24+K25","v":36},"DNS",null,{"$f":"N24+N25","v":29},"00:01:47.970",null,{"$f":"Q24+Q25","v":38},"00:01:40.240",null,{"$f":"T24+T25","v":40},null,{"$f":"V24+U25","v":223}]
[12,"B 9 yrs 4 x lL",{"$f":"IF(ISERROR(FIND(\"Relay\", $B28)),  IF('Lane 2'!$C25=\"Swimmer\", \"\", 'Lane 2'!$C25), \"Relay\")","v":"Relay"},{"$f":"IF(OR(C28=\"DQ\",C28=\"DNS\"),\"-\",IF(C28=SMALL((C28,F28,I28,L28,O28,R28),1),1,IF(C28=SMALL((C28,F28,I28,L28,O28,R28),2),2,IF(C28=SMALL((C28,F28,I28,L28,O28,R28),3),3,IF(C28=SMALL((C28,F28,I28,L28,O28,R28),4),4,IF(C28=SMALL((C28,F28,I28,L28,O28,R28),5),5,IF(C28=SMALL((C28,F28,I28,L28,O28,R28),6),6)))))))","v":3},{"$f":"IF(ISTEXT(D27),0,7-D27)","v":4},{"$f":"IF(ISERROR(FIND(\"Relay\", $B28)),  IF('Lane 3'!$C25=\"Swimmer\", \"\", 'Lane 3'!$C25), \"Relay\")","v":"Relay"},{"$f":"IF(OR(F28=\"DQ\",F28=\"DNS\"),\"-\",IF(F28=SMALL((C28,F28,I28,L28,O28,R28),1),1,IF(F28=SMALL((C28,F28,I28,L28,O28,R28),2),2,IF(F28=SMALL((C28,F28,I28,L28,O28,R28),3),3,IF(F28=SMALL((C28,F28,I28,L28,O28,R28),4),4,IF(F28=SMALL((C28,F28,I28,L28,O28,R28),5),5,IF(F28=SMALL((C28,F28,I28,L28,O28,R28),6),6)))))))","v":2},{"$f":"IF(ISTEXT(G27),0,7-G27)","v":5},{"$f":"IF(ISERROR(FIND(\"Relay\", $B28)),  IF('Lane 4'!$C25=\"Swimmer\", \"\", 'Lane 4'!$C25), \"Relay\")","v":"Relay"},{"$f":"IF(OR(I28=\"DQ\",I28=\"DNS\"),\"-\",IF(I28=SMALL((C28,F28,I28,L28,O28,R28),1),1,IF(I28=SMALL((C28,F28,I28,L28,O28,R28),2),2,IF(I28=SMALL((C28,F28,I28,L28,O28,R28),3),3,IF(I28=SMALL((C28,F28,I28,L28,O28,R28),4),4,IF(I28=SMALL((C28,F28,I28,L28,O28,R28),5),5,IF(I28=SMALL((C28,F28,I28,L28,O28,R28),6),6)))))))","v":"-"},{"$f":"IF(ISTEXT(J27),0,7-J27)","v":0},{"$f":"IF(ISERROR(FIND(\"Relay\", $B28)),  IF('Lane 5'!$C25=\"Swimmer\", \"\", 'Lane 5'!$C25), \"Relay\")","v":"Relay"},{"$f":"IF(OR(L28=\"DQ\",L28=\"DNS\"),\"-\",IF(L28=SMALL((C28,F28,I28,L28,O28,R28),1),1,IF(L28=SMALL((C28,F28,I28,L28,O28,R28),2),2,IF(L28=SMALL((C28,F28,I28,L28,O28,R28),3),3,IF(L28=SMALL((C28,F28,I28,L28,O28,R28),4),4,IF(L28=SMALL((C28,F28,I28,L28,O28,R28),5),5,IF(L28=SMALL((C28,F28,I28,L28,O28,R28),6),6)))))))","v":"-"},{"$f":"IF(ISTEXT(M27),0,7-M27)","v":0},{"$f":"IF(ISERROR(FIND(\"Relay\", $B28)),  IF('Lane 6'!$C25=\"Swimmer\", \"\", 'Lane 6'!$C25), \"Relay\")","v":"Relay"},{"$f":"IF(OR(O28=\"DQ\",O28=\"DNS\"),\"-\",IF(O28=SMALL((C28,F28,I28,L28,O28,R28),1),1,IF(O28=SMALL((C28,F28,I28,L28,O28,R28),2),2,IF(O28=SMALL((C28,F28,I28,L28,O28,R28),3),3,IF(O28=SMALL((C28,F28,I28,L28,O28,R28),4),4,IF(O28=SMALL((C28,F28,I28,L28,O28,R28),5),5,IF(O28=SMALL((C28,F28,I28,L28,O28,R28),6),6)))))))","v":4},{"$f":"IF(ISTEXT(P27),0,7-P27)","v":3},{"$f":"IF(ISERROR(FIND(\"Relay\", $B28)),  IF('Lane 1'!$D25=\"Swimmer\", \"\", 'Lane 1'!$D25), \"Relay\")","v":"Relay"},{"$f":"IF(OR(R28=\"DQ\",R28=\"DNS\"),\"-\",IF(R28=SMALL((C28,F28,I28,L28,O28,R28),1),1,IF(R28=SMALL((C28,F28,I28,L28,O28,R28),2),2,IF(R28=SMALL((C28,F28,I28,L28,O28,R28),3),3,IF(R28=SMALL((C28,F28,I28,L28,O28,R28),4),4,IF(R28=SMALL((C28,F28,I28,L28,O28,R28),5),5,IF(R28=SMALL((C28,F28,I28,L28,O28,R28),6),6)))))))","v":1},{"$f":"IF(ISTEXT(S27),0,7-S27)","v":6},{"$f":"T27+Q27+N27+K27+H27+E27","v":18}]
[null,"Medley Relay","00:01:50.950",null,{"$f":"E26+E27","v":43},"00:01:38.180",null,{"$f":"H26+H27","v":46},"DNS",null,{"$f":"K26+K27","v":36},"DNS",null,{"$f":"N26+N27","v":29},"00:01:59.780",null,{"$f":"Q26+Q27","v":41},"00:01:33.220",null,{"$f":"T26+T27","v":46},null,{"$f":"V26+U27","v":241}]
[13,"G 11/u 4 x lL",{"$f":"IF(ISERROR(FIND(\"Relay\", $B30)),  IF('Lane 2'!$C27=\"Swimmer\", \"\", 'Lane 2'!$C27), \"Relay\")","v":"Relay"},{"$f":"IF(OR(C30=\"DQ\",C30=\"DNS\"),\"-\",IF(C30=SMALL((C30,F30,I30,L30,O30,R30),1),1,IF(C30=SMALL((C30,F30,I30,L30,O30,R30),2),2,IF(C30=SMALL((C30,F30,I30,L30,O30,R30),3),3,IF(C30=SMALL((C30,F30,I30,L30,O30,R30),4),4,IF(C30=SMALL((C30,F30,I30,L30,O30,R30),5),5,IF(C30=SMALL((C30,F30,I30,L30,O30,R30),6),6)))))))","v":3},{"$f":"IF(ISTEXT(D29),0,7-D29)","v":4},{"$f":"IF(ISERROR(FIND(\"Relay\", $B30)),  IF('Lane 3'!$C27=\"Swimmer\", \"\", 'Lane 3'!$C27), \"Relay\")","v":"Relay"},{"$f":"IF(OR(F30=\"DQ\",F30=\"DNS\"),\"-\",IF(F30=SMALL((C30,F30,I30,L30,O30,R30),1),1,IF(F30=SMALL((C30,F30,I30,L30,O30,R30),2),2,IF(F30=SMALL((C30,F30,I30,L30,O30,R30),3),3,IF(F30=SMALL((C30,F30,I30,L30,O30,R30),4),4,IF(F30=SMALL((C30,F30,I30,L30,O30,R30),5),5,IF(F30=SMALL((C30,F30,I30,L30,O30,R30),6),6)))))))","v":1},{"$f":"IF(ISTEXT(G29),0,7-G29)","v":6},{"$f":"IF(ISERROR(FIND(\"Relay\", $B30)),  IF('Lane 4'!$C27=\"Swimmer\", \"\", 'Lane 4'!$C27), \"Relay\")","v":"Relay"},{"$f":"IF(OR(I30=\"DQ\",I30=\"DNS\"),\"-\",IF(I30=SMALL((C30,F30,I30,L30,O30,R30),1),1,IF(I30=SMALL((C30,F30,I30,L30,O30,R30),2),2,IF(I30=SMALL((C30,F30,I30,L30,O30,R30),3),3,IF(I30=SMALL((C30,F30,I30,L30,O30,R30),4),4,IF(I30=SMALL((C30,F30,I30,L30,O30,R30),5),5,IF(I30=SMALL((C30,F30,I30,L30,O30,R30),6),6)))))))","v":4},{"$f":"IF(ISTEXT(J29),0,7-J29)","v":3},{"$f":"IF(ISERROR(FIND(\"Relay\", $B30)),  IF('Lane 5'!$C27=\"Swimmer\", \"\", 'Lane 5'!$C27), \"Relay\")","v":"Relay"},{"$f":"IF(OR(L30=\"DQ\",L30=\"DNS\"),\"-\",IF(L30=SMALL((C30,F30,I30,L30,O30,R30),1),1,IF(L30=SMALL((C30,F30,I30,L30,O30,R30),2),2,IF(L30=SMALL((C30,F30,I30,L30,O30,R30),3),3,IF(L30=SMALL((C30,F30,I30,L30,O30,R30),4),4,IF(L30=SMALL((C30,F30,I30,L30,O30,R30),5),5,IF(L30=SMALL((C30,F30,I30,L30,O30,R30),6),6)))))))","v":6},{"$f":"IF(ISTEXT(M29),0,7-M29)","v":1},{"$f":"IF(ISERROR(FIND(\"Relay\", $B30)),  IF('Lane 6'!$C27=\"Swimmer\", \"\", 'Lane 6'!$C27), \"Relay\")","v":"Relay"},{"$f":"IF(OR(O30=\"DQ\",O30=\"DNS\"),\"-\",IF(O30=SMALL((C30,F30,I30,L30,O30,R30),1),1,IF(O30=SMALL((C30,F30,I30,L30,O30,R30),2),2,IF(O30=SMALL((C30,F30,I30,L30,O30,R30),3),3,IF(O30=SMALL((C30,F30,I30,L30,O30,R30),4),4,IF(O30=SMALL((C30,F30,I30,L30,O30,R30),5),5,IF(O30=SMALL((C30,F30,I30,L30,O30,R30),6),6)))))))","v":2},{"$f":"IF(ISTEXT(P29),0,7-P29)","v":5},{"$f":"IF(ISERROR(FIND(\"Relay\", $B30)),  IF('Lane 1'!$D27=\"Swimmer\", \"\", 'Lane 1'!$D27), \"Relay\")","v":"Relay"},{"$f":"IF(OR(R30=\"DQ\",R30=\"DNS\"),\"-\",IF(R30=SMALL((C30,F30,I30,L30,O30,R30),1),1,IF(R30=SMALL((C30,F30,I30,L30,O30,R30),2),2,IF(R30=SMALL((C30,F30,I30,L30,O30,R30),3),3,IF(R30=SMALL((C30,F30,I30,L30,O30,R30),4),4,IF(R30=SMALL((C30,F30,I30,L30,O30,R30),5),5,IF(R30=SMALL((C30,F30,I30,L30,O30,R30),6),6)))))))","v":5},{"$f":"IF(ISTEXT(S29),0,7-S29)","v":2},{"$f":"T29+Q29+N29+K29+H29+E29","v":21}]
[null,"Freestyle Relay","00:01:18.060",null,{"$f":"E28+E29","v":47},"00:01:12.840",null,{"$f":"H28+H29","v":52},"00:01:20.660",null,{"$f":"K28+K29","v":39},"00:01:48",null,{"$f":"N28+N29","v":30},"00:01:14.150",null,{"$f":"Q28+Q29","v":46},"00:01:21.120",null,{"$f":"T28+T29","v":48},null,{"$f":"V28+U29","v":262}]
[14,"B 11/u 4 x 1L",{"$f":"IF(ISERROR(FIND(\"Relay\", $B32)),  IF('Lane 2'!$C29=\"Swimmer\", \"\", 'Lane 2'!$C29), \"Relay\")","v":"Relay"},{"$f":"IF(OR(C32=\"DQ\",C32=\"DNS\"),\"-\",IF(C32=SMALL((C32,F32,I32,L32,O32,R32),1),1,IF(C32=SMALL((C32,F32,I32,L32,O32,R32),2),2,IF(C32=SMALL((C32,F32,I32,L32,O32,R32),3),3,IF(C32=SMALL((C32,F32,I32,L32,O32,R32),4),4,IF(C32=SMALL((C32,F32,I32,L32,O32,R32),5),5,IF(C32=SMALL((C32,F32,I32,L32,O32,R32),6),6)))))))","v":6},{"$f":"IF(ISTEXT(D31),0,7-D31)","v":1},{"$f":"IF(ISERROR(FIND(\"Relay\", $B32)),  IF('Lane 3'!$C29=\"Swimmer\", \"\", 'Lane 3'!$C29), \"Relay\")","v":"Relay"},{"$f":"IF(OR(F32=\"DQ\",F32=\"DNS\"),\"-\",IF(F32=SMALL((C32,F32,I32,L32,O32,R32),1),1,IF(F32=SMALL((C32,F32,I32,L32,O32,R32),2),2,IF(F32=SMALL((C32,F32,I32,L32,O32,R32),3),3,IF(F32=SMALL((C32,F32,I32,L32,O32,R32),4),4,IF(F32=SMALL((C32,F32,I32,L32,O32,R32),5),5,IF(F32=SMALL((C32,F32,I32,L32,O32,R32),6),6)))))))","v":1},{"$f":"IF(ISTEXT(G31),0,7-G31)","v":6},{"$f":"IF(ISERROR(FIND(\"Relay\", $B32)),  IF('Lane 4'!$C29=\"Swimmer\", \"\", 'Lane 4'!$C29), \"Relay\")","v":"Relay"},{"$f":"IF(OR(I32=\"DQ\",I32=\"DNS\"),\"-\",IF(I32=SMALL((C32,F32,I32,L32,O32,R32),1),1,IF(I32=SMALL((C32,F32,I32,L32,O32,R32),2),2,IF(I32=SMALL((C32,F32,I32,L32,O32,R32),3),3,IF(I32=SMALL((C32,F32,I32,L32,O32,R32),4),4,IF(I32=SMALL((C32,F32,I32,L32,O32,R32),5),5,IF(I32=SMALL((C32,F32,I32,L32,O32,R32),6),6)))))))","v":3},{"$f":"IF(ISTEXT(J31),0,7-J31)","v":4},{"$f":"IF(ISERROR(FIND(\"Relay\", $B32)),  IF('Lane 5'!$C29=\"Swimmer\", \"\", 'Lane 5'!$C29), \"Relay\")","v":"Relay"},{"$f":"IF(OR(L32=\"DQ\",L32=\"DNS\"),\"-\",IF(L32=SMALL((C32,F32,I32,L32,O32,R32),1),1,IF(L32=SMALL((C32,F32,I32,L32,O32,R32),2),2,IF(L32=SMALL((C32,F32,I32,L32,O32,R32),3),3,IF(L32=SMALL((C32,F32,I32,L32,O32,R32),4),4,IF(L32=SMALL((C32,F32,I32,L32,O32,R32),5),5,IF(L32=SMALL((C32,F32,I32,L32,O32,R32),6),6)))))))","v":5},{"$f":"IF(ISTEXT(M31),0,7-M31)","v":2},{"$f":"IF(ISERROR(FIND(\"Relay\", $B32)),  IF('Lane 6'!$C29=\"Swimmer\", \"\", 'Lane 6'!$C29), \"Relay\")","v":"Relay"},{"$f":"IF(OR(O32=\"DQ\",O32=\"DNS\"),\"-\",IF(O32=SMALL((C32,F32,I32,L32,O32,R32),1),1,IF(O32=SMALL((C32,F32,I32,L32,O32,R32),2),2,IF(O32=SMALL((C32,F32,I32,L32,O32,R32),3),3,IF(O32=SMALL((C32,F32,I32,L32,O32,R32),4),4,IF(O32=SMALL((C32,F32,I32,L32,O32,R32),5),5,IF(O32=SMALL((C32,F32,I32,L32,O32,R32),6),6)))))))","v":2},{"$f":"IF(ISTEXT(P31),0,7-P31)","v":5},{"$f":"IF(ISERROR(FIND(\"Relay\", $B32)),  IF('Lane 1'!$D29=\"Swimmer\", \"\", 'Lane 1'!$D29), \"Relay\")","v":"Relay"},{"$f":"IF(OR(R32=\"DQ\",R32=\"DNS\"),\"-\",IF(R32=SMALL((C32,F32,I32,L32,O32,R32),1),1,IF(R32=SMALL((C32,F32,I32,L32,O32,R32),2),2,IF(R32=SMALL((C32,F32,I32,L32,O32,R32),3),3,IF(R32=SMALL((C32,F32,I32,L32,O32,R32),4),4,IF(R32=SMALL((C32,F32,I32,L32,O32,R32),5),5,IF(R32=SMALL((C32,F32,I32,L32,O32,R32),6),6)))))))","v":4},{"$f":"IF(ISTEXT(S31),0,7-S31)","v":3},{"$f":"T31+Q31+N31+K31+H31+E31","v":21}]
[null,"Freestyle Relay","00:01:19.790",null,{"$f":"E30+E31","v":48},"00:01:07.110",null,{"$f":"H30+H31","v":58},"00:01:10.310",null,{"$f":"K30+K31","v":43},"00:01:12.600",null,{"$f":"N30+N31","v":32},"00:01:10.120",null,{"$f":"Q30+Q31","v":51},"00:01:10.340",null,{"$f":"T30+T31","v":51},null,{"$f":"V30+U31","v":283}]
[15,"G 12/u 2L",{"$f":"IF(ISERROR(FIND(\"Relay\", $B34)),  IF('Lane 2'!$C31=\"Swimmer\", \"\", 'Lane 2'!$C31), \"Relay\")","v":"Amber Valletta"},{"$f":"IF(OR(C34=\"DQ\",C34=\"DNS\"),\"-\",IF(C34=SMALL((C34,F34,I34,L34,O34,R34),1),1,IF(C34=SMALL((C34,F34,I34,L34,O34,R34),2),2,IF(C34=SMALL((C34,F34,I34,L34,O34,R34),3),3,IF(C34=SMALL((C34,F34,I34,L34,O34,R34),4),4,IF(C34=SMALL((C34,F34,I34,L34,O34,R34),5),5,IF(C34=SMALL((C34,F34,I34,L34,O34,R34),6),6)))))))","v":6},{"$f":"IF(ISTEXT(D33),0,7-D33)","v":1},{"$f":"IF(ISERROR(FIND(\"Relay\", $B34)),  IF('Lane 3'!$C31=\"Swimmer\", \"\", 'Lane 3'!$C31), \"Relay\")","v":"Emily Withey"},{"$f":"IF(OR(F34=\"DQ\",F34=\"DNS\"),\"-\",IF(F34=SMALL((C34,F34,I34,L34,O34,R34),1),1,IF(F34=SMALL((C34,F34,I34,L34,O34,R34),2),2,IF(F34=SMALL((C34,F34,I34,L34,O34,R34),3),3,IF(F34=SMALL((C34,F34,I34,L34,O34,R34),4),4,IF(F34=SMALL((C34,F34,I34,L34,O34,R34),5),5,IF(F34=SMALL((C34,F34,I34,L34,O34,R34),6),6)))))))","v":4},{"$f":"IF(ISTEXT(G33),0,7-G33)","v":3},{"$f":"IF(ISERROR(FIND(\"Relay\", $B34)),  IF('Lane 4'!$C31=\"Swimmer\", \"\", 'Lane 4'!$C31), \"Relay\")","v":"Molly Faber"},{"$f":"IF(OR(I34=\"DQ\",I34=\"DNS\"),\"-\",IF(I34=SMALL((C34,F34,I34,L34,O34,R34),1),1,IF(I34=SMALL((C34,F34,I34,L34,O34,R34),2),2,IF(I34=SMALL((C34,F34,I34,L34,O34,R34),3),3,IF(I34=SMALL((C34,F34,I34,L34,O34,R34),4),4,IF(I34=SMALL((C34,F34,I34,L34,O34,R34),5),5,IF(I34=SMALL((C34,F34,I34,L34,O34,R34),6),6)))))))","v":3},{"$f":"IF(ISTEXT(J33),0,7-J33)","v":4},{"$f":"IF(ISERROR(FIND(\"Relay\", $B34)),  IF('Lane 5'!$C31=\"Swimmer\", \"\", 'Lane 5'!$C31), \"Relay\")","v":"Charlotte Inshaw"},{"$f":"IF(OR(L34=\"DQ\",L34=\"DNS\"),\"-\",IF(L34=SMALL((C34,F34,I34,L34,O34,R34),1),1,IF(L34=SMALL((C34,F34,I34,L34,O34,R34),2),2,IF(L34=SMALL((C34,F34,I34,L34,O34,R34),3),3,IF(L34=SMALL((C34,F34,I34,L34,O34,R34),4),4,IF(L34=SMALL((C34,F34,I34,L34,O34,R34),5),5,IF(L34=SMALL((C34,F34,I34,L34,O34,R34),6),6)))))))","v":1},{"$f":"IF(ISTEXT(M33),0,7-M33)","v":6},{"$f":"IF(ISERROR(FIND(\"Relay\", $B34)),  IF('Lane 6'!$C31=\"Swimmer\", \"\", 'Lane 6'!$C31), \"Relay\")","v":"A Robathan"},{"$f":"IF(OR(O34=\"DQ\",O34=\"DNS\"),\"-\",IF(O34=SMALL((C34,F34,I34,L34,O34,R34),1),1,IF(O34=SMALL((C34,F34,I34,L34,O34,R34),2),2,IF(O34=SMALL((C34,F34,I34,L34,O34,R34),3),3,IF(O34=SMALL((C34,F34,I34,L34,O34,R34),4),4,IF(O34=SMALL((C34,F34,I34,L34,O34,R34),5),5,IF(O34=SMALL((C34,F34,I34,L34,O34,R34),6),6)))))))","v":5},{"$f":"IF(ISTEXT(P33),0,7-P33)","v":2},{"$f":"IF(ISERROR(FIND(\"Relay\", $B34)),  IF('Lane 1'!$C31=\"Swimmer\", \"\", 'Lane 1'!$C31), \"Relay\")","v":"Esther Cunniffe"},{"$f":"IF(OR(R34=\"DQ\",R34=\"DNS\"),\"-\",IF(R34=SMALL((C34,F34,I34,L34,O34,R34),1),1,IF(R34=SMALL((C34,F34,I34,L34,O34,R34),2),2,IF(R34=SMALL((C34,F34,I34,L34,O34,R34),3),3,IF(R34=SMALL((C34,F34,I34,L34,O34,R34),4),4,IF(R34=SMALL((C34,F34,I34,L34,O34,R34),5),5,IF(R34=SMALL((C34,F34,I34,L34,O34,R34),6),6)))))))","v":2},{"$f":"IF(ISTEXT(S33),0,7-S33)","v":5},{"$f":"T33+Q33+N33+K33+H33+E33","v":21}]
[null,"Butterfly","00:00:47.600",null,{"$f":"E32+E33","v":49},"00:00:46.300",null,{"$f":"H32+H33","v":61},"00:00:46.130",null,{"$f":"K32+K33","v":47},"00:00:33.750",null,{"$f":"N32+N33","v":38},"00:00:47.590",null,{"$f":"Q32+Q33","v":53},"00:00:37.720",null,{"$f":"T32+T33","v":56},null,{"$f":"V32+U33","v":304}]
[16,"B 12/u 2L",{"$f":"IF(ISERROR(FIND(\"Relay\", $B36)),  IF('Lane 2'!$C33=\"Swimmer\", \"\", 'Lane 2'!$C33), \"Relay\")","v":"Solomon Mansfield"},{"$f":"IF(OR(C36=\"DQ\",C36=\"DNS\"),\"-\",IF(C36=SMALL((C36,F36,I36,L36,O36,R36),1),1,IF(C36=SMALL((C36,F36,I36,L36,O36,R36),2),2,IF(C36=SMALL((C36,F36,I36,L36,O36,R36),3),3,IF(C36=SMALL((C36,F36,I36,L36,O36,R36),4),4,IF(C36=SMALL((C36,F36,I36,L36,O36,R36),5),5,IF(C36=SMALL((C36,F36,I36,L36,O36,R36),6),6)))))))","v":4},{"$f":"IF(ISTEXT(D35),0,7-D35)","v":3},{"$f":"IF(ISERROR(FIND(\"Relay\", $B36)),  IF('Lane 3'!$C33=\"Swimmer\", \"\", 'Lane 3'!$C33), \"Relay\")","v":"Harvey Ashead"},{"$f":"IF(OR(F36=\"DQ\",F36=\"DNS\"),\"-\",IF(F36=SMALL((C36,F36,I36,L36,O36,R36),1),1,IF(F36=SMALL((C36,F36,I36,L36,O36,R36),2),2,IF(F36=SMALL((C36,F36,I36,L36,O36,R36),3),3,IF(F36=SMALL((C36,F36,I36,L36,O36,R36),4),4,IF(F36=SMALL((C36,F36,I36,L36,O36,R36),5),5,IF(F36=SMALL((C36,F36,I36,L36,O36,R36),6),6)))))))","v":5},{"$f":"IF(ISTEXT(G35),0,7-G35)","v":2},{"$f":"IF(ISERROR(FIND(\"Relay\", $B36)),  IF('Lane 4'!$C33=\"Swimmer\", \"\", 'Lane 4'!$C33), \"Relay\")","v":"Dylan Abulencia"},{"$f":"IF(OR(I36=\"DQ\",I36=\"DNS\"),\"-\",IF(I36=SMALL((C36,F36,I36,L36,O36,R36),1),1,IF(I36=SMALL((C36,F36,I36,L36,O36,R36),2),2,IF(I36=SMALL((C36,F36,I36,L36,O36,R36),3),3,IF(I36=SMALL((C36,F36,I36,L36,O36,R36),4),4,IF(I36=SMALL((C36,F36,I36,L36,O36,R36),5),5,IF(I36=SMALL((C36,F36,I36,L36,O36,R36),6),6)))))))","v":1},{"$f":"IF(ISTEXT(J35),0,7-J35)","v":6},{"$f":"IF(ISERROR(FIND(\"Relay\", $B36)),  IF('Lane 5'!$C33=\"Swimmer\", \"\", 'Lane 5'!$C33), \"Relay\")","v":"Alfiie Cowie"},{"$f":"IF(OR(L36=\"DQ\",L36=\"DNS\"),\"-\",IF(L36=SMALL((C36,F36,I36,L36,O36,R36),1),1,IF(L36=SMALL((C36,F36,I36,L36,O36,R36),2),2,IF(L36=SMALL((C36,F36,I36,L36,O36,R36),3),3,IF(L36=SMALL((C36,F36,I36,L36,O36,R36),4),4,IF(L36=SMALL((C36,F36,I36,L36,O36,R36),5),5,IF(L36=SMALL((C36,F36,I36,L36,O36,R36),6),6)))))))","v":2},{"$f":"IF(ISTEXT(M35),0,7-M35)","v":5},{"$f":"IF(ISERROR(FIND(\"Relay\", $B36)),  IF('Lane 6'!$C33=\"Swimmer\", \"\", 'Lane 6'!$C33), \"Relay\")","v":"C Fletcher"},{"$f":"IF(OR(O36=\"DQ\",O36=\"DNS\"),\"-\",IF(O36=SMALL((C36,F36,I36,L36,O36,R36),1),1,IF(O36=SMALL((C36,F36,I36,L36,O36,R36),2),2,IF(O36=SMALL((C36,F36,I36,L36,O36,R36),3),3,IF(O36=SMALL((C36,F36,I36,L36,O36,R36),4),4,IF(O36=SMALL((C36,F36,I36,L36,O36,R36),5),5,IF(O36=SMALL((C36,F36,I36,L36,O36,R36),6),6)))))))","v":6},{"$f":"IF(ISTEXT(P35),0,7-P35)","v":1},{"$f":"IF(ISERROR(FIND(\"Relay\", $B36)),  IF('Lane 1'!$C33=\"Swimmer\", \"\", 'Lane 1'!$C33), \"Relay\")","v":"Luca Whaley"},{"$f":"IF(OR(R36=\"DQ\",R36=\"DNS\"),\"-\",IF(R36=SMALL((C36,F36,I36,L36,O36,R36),1),1,IF(R36=SMALL((C36,F36,I36,L36,O36,R36),2),2,IF(R36=SMALL((C36,F36,I36,L36,O36,R36),3),3,IF(R36=SMALL((C36,F36,I36,L36,O36,R36),4),4,IF(R36=SMALL((C36,F36,I36,L36,O36,R36),5),5,IF(R36=SMALL((C36,F36,I36,L36,O36,R36),6),6)))))))","v":3},{"$f":"IF(ISTEXT(S35),0,7-S35)","v":4},{"$f":"T35+Q35+N35+K35+H35+E35","v":21}]
[null," Butterfly","00:00:43.840",null,{"$f":"E34+E35","v":52},"00:00:44.460",null,{"$f":"H34+H35","v":63},"00:00:35.350",null,{"$f":"K34+K35","v":53},"00:00:36.380",null,{"$f":"N34+N35","v":43},"00:00:46.100",null,{"$f":"Q34+Q35","v":54},"00:00:38.590",null,{"$f":"T34+T35","v":60},null,{"$f":"V34+U35","v":325}]
[17,"G 10/u 4 x1L",{"$f":"IF(ISERROR(FIND(\"Relay\", $B38)),  IF('Lane 2'!$C35=\"Swimmer\", \"\", 'Lane 2'!$C35), \"Relay\")","v":"Relay"},{"$f":"IF(OR(C38=\"DQ\",C38=\"DNS\"),\"-\",IF(C38=SMALL((C38,F38,I38,L38,O38,R38),1),1,IF(C38=SMALL((C38,F38,I38,L38,O38,R38),2),2,IF(C38=SMALL((C38,F38,I38,L38,O38,R38),3),3,IF(C38=SMALL((C38,F38,I38,L38,O38,R38),4),4,IF(C38=SMALL((C38,F38,I38,L38,O38,R38),5),5,IF(C38=SMALL((C38,F38,I38,L38,O38,R38),6),6)))))))","v":3},{"$f":"IF(ISTEXT(D37),0,7-D37)","v":4},{"$f":"IF(ISERROR(FIND(\"Relay\", $B38)),  IF('Lane 3'!$C35=\"Swimmer\", \"\", 'Lane 3'!$C35), \"Relay\")","v":"Relay"},{"$f":"IF(OR(F38=\"DQ\",F38=\"DNS\"),\"-\",IF(F38=SMALL((C38,F38,I38,L38,O38,R38),1),1,IF(F38=SMALL((C38,F38,I38,L38,O38,R38),2),2,IF(F38=SMALL((C38,F38,I38,L38,O38,R38),3),3,IF(F38=SMALL((C38,F38,I38,L38,O38,R38),4),4,IF(F38=SMALL((C38,F38,I38,L38,O38,R38),5),5,IF(F38=SMALL((C38,F38,I38,L38,O38,R38),6),6)))))))","v":2},{"$f":"IF(ISTEXT(G37),0,7-G37)","v":5},{"$f":"IF(ISERROR(FIND(\"Relay\", $B38)),  IF('Lane 4'!$C35=\"Swimmer\", \"\", 'Lane 4'!$C35), \"Relay\")","v":"Relay"},{"$f":"IF(OR(I38=\"DQ\",I38=\"DNS\"),\"-\",IF(I38=SMALL((C38,F38,I38,L38,O38,R38),1),1,IF(I38=SMALL((C38,F38,I38,L38,O38,R38),2),2,IF(I38=SMALL((C38,F38,I38,L38,O38,R38),3),3,IF(I38=SMALL((C38,F38,I38,L38,O38,R38),4),4,IF(I38=SMALL((C38,F38,I38,L38,O38,R38),5),5,IF(I38=SMALL((C38,F38,I38,L38,O38,R38),6),6)))))))","v":1},{"$f":"IF(ISTEXT(J37),0,7-J37)","v":6},{"$f":"IF(ISERROR(FIND(\"Relay\", $B38)),  IF('Lane 5'!$C35=\"Swimmer\", \"\", 'Lane 5'!$C35), \"Relay\")","v":"Relay"},{"$f":"IF(OR(L38=\"DQ\",L38=\"DNS\"),\"-\",IF(L38=SMALL((C38,F38,I38,L38,O38,R38),1),1,IF(L38=SMALL((C38,F38,I38,L38,O38,R38),2),2,IF(L38=SMALL((C38,F38,I38,L38,O38,R38),3),3,IF(L38=SMALL((C38,F38,I38,L38,O38,R38),4),4,IF(L38=SMALL((C38,F38,I38,L38,O38,R38),5),5,IF(L38=SMALL((C38,F38,I38,L38,O38,R38),6),6)))))))","v":5},{"$f":"IF(ISTEXT(M37),0,7-M37)","v":2},{"$f":"IF(ISERROR(FIND(\"Relay\", $B38)),  IF('Lane 6'!$C35=\"Swimmer\", \"\", 'Lane 6'!$C35), \"Relay\")","v":"Relay"},{"$f":"IF(OR(O38=\"DQ\",O38=\"DNS\"),\"-\",IF(O38=SMALL((C38,F38,I38,L38,O38,R38),1),1,IF(O38=SMALL((C38,F38,I38,L38,O38,R38),2),2,IF(O38=SMALL((C38,F38,I38,L38,O38,R38),3),3,IF(O38=SMALL((C38,F38,I38,L38,O38,R38),4),4,IF(O38=SMALL((C38,F38,I38,L38,O38,R38),5),5,IF(O38=SMALL((C38,F38,I38,L38,O38,R38),6),6)))))))","v":"-"},{"$f":"IF(ISTEXT(P37),0,7-P37)","v":0},{"$f":"IF(ISERROR(FIND(\"Relay\", $B38)),  IF('Lane 1'!$D35=\"Swimmer\", \"\", 'Lane 1'!$D35), \"Relay\")","v":"Relay"},{"$f":"IF(OR(R38=\"DQ\",R38=\"DNS\"),\"-\",IF(R38=SMALL((C38,F38,I38,L38,O38,R38),1),1,IF(R38=SMALL((C38,F38,I38,L38,O38,R38),2),2,IF(R38=SMALL((C38,F38,I38,L38,O38,R38),3),3,IF(R38=SMALL((C38,F38,I38,L38,O38,R38),4),4,IF(R38=SMALL((C38,F38,I38,L38,O38,R38),5),5,IF(R38=SMALL((C38,F38,I38,L38,O38,R38),6),6)))))))","v":4},{"$f":"IF(ISTEXT(S37),0,7-S37)","v":3},{"$f":"T37+Q37+N37+K37+H37+E37","v":20}]
[null,"Medley Relay","00:01:31.780",null,{"$f":"E36+E37","v":56},"00:01:30.330",null,{"$f":"H36+H37","v":68},"00:01:29.930",null,{"$f":"K36+K37","v":59},"00:02:03.620",null,{"$f":"N36+N37","v":45},"DQ",null,{"$f":"Q36+Q37","v":54},"00:01:36.410",null,{"$f":"T36+T37","v":63},null,{"$f":"V36+U37","v":345}]
[18,"B 10/u 4 x 1L",{"$f":"IF(ISERROR(FIND(\"Relay\", $B40)),  IF('Lane 2'!$C37=\"Swimmer\", \"\", 'Lane 2'!$C37), \"Relay\")","v":"Relay"},{"$f":"IF(OR(C40=\"DQ\",C40=\"DNS\"),\"-\",IF(C40=SMALL((C40,F40,I40,L40,O40,R40),1),1,IF(C40=SMALL((C40,F40,I40,L40,O40,R40),2),2,IF(C40=SMALL((C40,F40,I40,L40,O40,R40),3),3,IF(C40=SMALL((C40,F40,I40,L40,O40,R40),4),4,IF(C40=SMALL((C40,F40,I40,L40,O40,R40),5),5,IF(C40=SMALL((C40,F40,I40,L40,O40,R40),6),6)))))))","v":"-"},{"$f":"IF(ISTEXT(D39),0,7-D39)","v":0},{"$f":"IF(ISERROR(FIND(\"Relay\", $B40)),  IF('Lane 3'!$C37=\"Swimmer\", \"\", 'Lane 3'!$C37), \"Relay\")","v":"Relay"},{"$f":"IF(OR(F40=\"DQ\",F40=\"DNS\"),\"-\",IF(F40=SMALL((C40,F40,I40,L40,O40,R40),1),1,IF(F40=SMALL((C40,F40,I40,L40,O40,R40),2),2,IF(F40=SMALL((C40,F40,I40,L40,O40,R40),3),3,IF(F40=SMALL((C40,F40,I40,L40,O40,R40),4),4,IF(F40=SMALL((C40,F40,I40,L40,O40,R40),5),5,IF(F40=SMALL((C40,F40,I40,L40,O40,R40),6),6)))))))","v":1},{"$f":"IF(ISTEXT(G39),0,7-G39)","v":6},{"$f":"IF(ISERROR(FIND(\"Relay\", $B40)),  IF('Lane 4'!$C37=\"Swimmer\", \"\", 'Lane 4'!$C37), \"Relay\")","v":"Relay"},{"$f":"IF(OR(I40=\"DQ\",I40=\"DNS\"),\"-\",IF(I40=SMALL((C40,F40,I40,L40,O40,R40),1),1,IF(I40=SMALL((C40,F40,I40,L40,O40,R40),2),2,IF(I40=SMALL((C40,F40,I40,L40,O40,R40),3),3,IF(I40=SMALL((C40,F40,I40,L40,O40,R40),4),4,IF(I40=SMALL((C40,F40,I40,L40,O40,R40),5),5,IF(I40=SMALL((C40,F40,I40,L40,O40,R40),6),6)))))))","v":2},{"$f":"IF(ISTEXT(J39),0,7-J39)","v":5},{"$f":"IF(ISERROR(FIND(\"Relay\", $B40)),  IF('Lane 5'!$C37=\"Swimmer\", \"\", 'Lane 5'!$C37), \"Relay\")","v":"Relay"},{"$f":"IF(OR(L40=\"DQ\",L40=\"DNS\"),\"-\",IF(L40=SMALL((C40,F40,I40,L40,O40,R40),1),1,IF(L40=SMALL((C40,F40,I40,L40,O40,R40),2),2,IF(L40=SMALL((C40,F40,I40,L40,O40,R40),3),3,IF(L40=SMALL((C40,F40,I40,L40,O40,R40),4),4,IF(L40=SMALL((C40,F40,I40,L40,O40,R40),5),5,IF(L40=SMALL((C40,F40,I40,L40,O40,R40),6),6)))))))","v":"-"},{"$f":"IF(ISTEXT(M39),0,7-M39)","v":0},{"$f":"IF(ISERROR(FIND(\"Relay\", $B40)),  IF('Lane 6'!$C37=\"Swimmer\", \"\", 'Lane 6'!$C37), \"Relay\")","v":"Relay"},{"$f":"IF(OR(O40=\"DQ\",O40=\"DNS\"),\"-\",IF(O40=SMALL((C40,F40,I40,L40,O40,R40),1),1,IF(O40=SMALL((C40,F40,I40,L40,O40,R40),2),2,IF(O40=SMALL((C40,F40,I40,L40,O40,R40),3),3,IF(O40=SMALL((C40,F40,I40,L40,O40,R40),4),4,IF(O40=SMALL((C40,F40,I40,L40,O40,R40),5),5,IF(O40=SMALL((C40,F40,I40,L40,O40,R40),6),6)))))))","v":3},{"$f":"IF(ISTEXT(P39),0,7-P39)","v":4},{"$f":"IF(ISERROR(FIND(\"Relay\", $B40)),  IF('Lane 1'!$D37=\"Swimmer\", \"\", 'Lane 1'!$D37), \"Relay\")","v":"Relay"},{"$f":"IF(OR(R40=\"DQ\",R40=\"DNS\"),\"-\",IF(R40=SMALL((C40,F40,I40,L40,O40,R40),1),1,IF(R40=SMALL((C40,F40,I40,L40,O40,R40),2),2,IF(R40=SMALL((C40,F40,I40,L40,O40,R40),3),3,IF(R40=SMALL((C40,F40,I40,L40,O40,R40),4),4,IF(R40=SMALL((C40,F40,I40,L40,O40,R40),5),5,IF(R40=SMALL((C40,F40,I40,L40,O40,R40),6),6)))))))","v":4},{"$f":"IF(ISTEXT(S39),0,7-S39)","v":3},{"$f":"T39+Q39+N39+K39+H39+E39","v":18}]
[null,"Medley Relay","DQ",null,{"$f":"E38+E39","v":56},"00:01:25.430",null,{"$f":"H38+H39","v":74},"00:01:29.560",null,{"$f":"K38+K39","v":64},"DNS",null,{"$f":"N38+N39","v":45},"00:01:29.580",null,{"$f":"Q38+Q39","v":58},"00:01:32.470",null,{"$f":"T38+T39","v":66},null,{"$f":"V38+U39","v":363}]
[19,"G 11/u 2L",{"$f":"IF(ISERROR(FIND(\"Relay\", $B42)),  IF('Lane 2'!$C39=\"Swimmer\", \"\", 'Lane 2'!$C39), \"Relay\")","v":"Isobelle Carpenter-Clay"},{"$f":"IF(OR(C42=\"DQ\",C42=\"DNS\"),\"-\",IF(C42=SMALL((C42,F42,I42,L42,O42,R42),1),1,IF(C42=SMALL((C42,F42,I42,L42,O42,R42),2),2,IF(C42=SMALL((C42,F42,I42,L42,O42,R42),3),3,IF(C42=SMALL((C42,F42,I42,L42,O42,R42),4),4,IF(C42=SMALL((C42,F42,I42,L42,O42,R42),5),5,IF(C42=SMALL((C42,F42,I42,L42,O42,R42),6),6)))))))","v":5},{"$f":"IF(ISTEXT(D41),0,7-D41)","v":2},{"$f":"IF(ISERROR(FIND(\"Relay\", $B42)),  IF('Lane 3'!$C39=\"Swimmer\", \"\", 'Lane 3'!$C39), \"Relay\")","v":"Molly Kirkland"},{"$f":"IF(OR(F42=\"DQ\",F42=\"DNS\"),\"-\",IF(F42=SMALL((C42,F42,I42,L42,O42,R42),1),1,IF(F42=SMALL((C42,F42,I42,L42,O42,R42),2),2,IF(F42=SMALL((C42,F42,I42,L42,O42,R42),3),3,IF(F42=SMALL((C42,F42,I42,L42,O42,R42),4),4,IF(F42=SMALL((C42,F42,I42,L42,O42,R42),5),5,IF(F42=SMALL((C42,F42,I42,L42,O42,R42),6),6)))))))","v":4},{"$f":"IF(ISTEXT(G41),0,7-G41)","v":3},{"$f":"IF(ISERROR(FIND(\"Relay\", $B42)),  IF('Lane 4'!$C39=\"Swimmer\", \"\", 'Lane 4'!$C39), \"Relay\")","v":"Eleanor Ribchester"},{"$f":"IF(OR(I42=\"DQ\",I42=\"DNS\"),\"-\",IF(I42=SMALL((C42,F42,I42,L42,O42,R42),1),1,IF(I42=SMALL((C42,F42,I42,L42,O42,R42),2),2,IF(I42=SMALL((C42,F42,I42,L42,O42,R42),3),3,IF(I42=SMALL((C42,F42,I42,L42,O42,R42),4),4,IF(I42=SMALL((C42,F42,I42,L42,O42,R42),5),5,IF(I42=SMALL((C42,F42,I42,L42,O42,R42),6),6)))))))","v":2},{"$f":"IF(ISTEXT(J41),0,7-J41)","v":5},{"$f":"IF(ISERROR(FIND(\"Relay\", $B42)),  IF('Lane 5'!$C39=\"Swimmer\", \"\", 'Lane 5'!$C39), \"Relay\")","v":"Indigo Perrett"},{"$f":"IF(OR(L42=\"DQ\",L42=\"DNS\"),\"-\",IF(L42=SMALL((C42,F42,I42,L42,O42,R42),1),1,IF(L42=SMALL((C42,F42,I42,L42,O42,R42),2),2,IF(L42=SMALL((C42,F42,I42,L42,O42,R42),3),3,IF(L42=SMALL((C42,F42,I42,L42,O42,R42),4),4,IF(L42=SMALL((C42,F42,I42,L42,O42,R42),5),5,IF(L42=SMALL((C42,F42,I42,L42,O42,R42),6),6)))))))","v":6},{"$f":"IF(ISTEXT(M41),0,7-M41)","v":1},{"$f":"IF(ISERROR(FIND(\"Relay\", $B42)),  IF('Lane 6'!$C39=\"Swimmer\", \"\", 'Lane 6'!$C39), \"Relay\")","v":"R Powell"},{"$f":"IF(OR(O42=\"DQ\",O42=\"DNS\"),\"-\",IF(O42=SMALL((C42,F42,I42,L42,O42,R42),1),1,IF(O42=SMALL((C42,F42,I42,L42,O42,R42),2),2,IF(O42=SMALL((C42,F42,I42,L42,O42,R42),3),3,IF(O42=SMALL((C42,F42,I42,L42,O42,R42),4),4,IF(O42=SMALL((C42,F42,I42,L42,O42,R42),5),5,IF(O42=SMALL((C42,F42,I42,L42,O42,R42),6),6)))))))","v":1},{"$f":"IF(ISTEXT(P41),0,7-P41)","v":6},{"$f":"IF(ISERROR(FIND(\"Relay\", $B42)),  IF('Lane 1'!$C39=\"Swimmer\", \"\", 'Lane 1'!$C39), \"Relay\")","v":"Eva Browne"},{"$f":"IF(OR(R42=\"DQ\",R42=\"DNS\"),\"-\",IF(R42=SMALL((C42,F42,I42,L42,O42,R42),1),1,IF(R42=SMALL((C42,F42,I42,L42,O42,R42),2),2,IF(R42=SMALL((C42,F42,I42,L42,O42,R42),3),3,IF(R42=SMALL((C42,F42,I42,L42,O42,R42),4),4,IF(R42=SMALL((C42,F42,I42,L42,O42,R42),5),5,IF(R42=SMALL((C42,F42,I42,L42,O42,R42),6),6)))))))","v":3},{"$f":"IF(ISTEXT(S41),0,7-S41)","v":4},{"$f":"T41+Q41+N41+K41+H41+E41","v":21}]
[null,"Backstroke","00:00:46.120",null,{"$f":"E40+E41","v":58},"00:00:45.830",null,{"$f":"H40+H41","v":77},"00:00:44.820",null,{"$f":"K40+K41","v":69},"00:00:53.870",null,{"$f":"N40+N41","v":46},"00:00:43.630",null,{"$f":"Q40+Q41","v":64},"00:00:45.090",null,{"$f":"T40+T41","v":70},null,{"$f":"V40+U41","v":384}]
[20,"B 11/u 2L",{"$f":"IF(ISERROR(FIND(\"Relay\", $B44)),  IF('Lane 2'!$C41=\"Swimmer\", \"\", 'Lane 2'!$C41), \"Relay\")","v":"Alex Walker"},{"$f":"IF(OR(C44=\"DQ\",C44=\"DNS\"),\"-\",IF(C44=SMALL((C44,F44,I44,L44,O44,R44),1),1,IF(C44=SMALL((C44,F44,I44,L44,O44,R44),2),2,IF(C44=SMALL((C44,F44,I44,L44,O44,R44),3),3,IF(C44=SMALL((C44,F44,I44,L44,O44,R44),4),4,IF(C44=SMALL((C44,F44,I44,L44,O44,R44),5),5,IF(C44=SMALL((C44,F44,I44,L44,O44,R44),6),6)))))))","v":2},{"$f":"IF(ISTEXT(D43),0,7-D43)","v":5},{"$f":"IF(ISERROR(FIND(\"Relay\", $B44)),  IF('Lane 3'!$C41=\"Swimmer\", \"\", 'Lane 3'!$C41), \"Relay\")","v":"Reece Johnson"},{"$f":"IF(OR(F44=\"DQ\",F44=\"DNS\"),\"-\",IF(F44=SMALL((C44,F44,I44,L44,O44,R44),1),1,IF(F44=SMALL((C44,F44,I44,L44,O44,R44),2),2,IF(F44=SMALL((C44,F44,I44,L44,O44,R44),3),3,IF(F44=SMALL((C44,F44,I44,L44,O44,R44),4),4,IF(F44=SMALL((C44,F44,I44,L44,O44,R44),5),5,IF(F44=SMALL((C44,F44,I44,L44,O44,R44),6),6)))))))","v":1},{"$f":"IF(ISTEXT(G43),0,7-G43)","v":6},{"$f":"IF(ISERROR(FIND(\"Relay\", $B44)),  IF('Lane 4'!$C41=\"Swimmer\", \"\", 'Lane 4'!$C41), \"Relay\")","v":"Thomas Ribchester"},{"$f":"IF(OR(I44=\"DQ\",I44=\"DNS\"),\"-\",IF(I44=SMALL((C44,F44,I44,L44,O44,R44),1),1,IF(I44=SMALL((C44,F44,I44,L44,O44,R44),2),2,IF(I44=SMALL((C44,F44,I44,L44,O44,R44),3),3,IF(I44=SMALL((C44,F44,I44,L44,O44,R44),4),4,IF(I44=SMALL((C44,F44,I44,L44,O44,R44),5),5,IF(I44=SMALL((C44,F44,I44,L44,O44,R44),6),6)))))))","v":3},{"$f":"IF(ISTEXT(J43),0,7-J43)","v":4},{"$f":"IF(ISERROR(FIND(\"Relay\", $B44)),  IF('Lane 5'!$C41=\"Swimmer\", \"\", 'Lane 5'!$C41), \"Relay\")","v":"Riley Talbot-Fielding"},{"$f":"IF(OR(L44=\"DQ\",L44=\"DNS\"),\"-\",IF(L44=SMALL((C44,F44,I44,L44,O44,R44),1),1,IF(L44=SMALL((C44,F44,I44,L44,O44,R44),2),2,IF(L44=SMALL((C44,F44,I44,L44,O44,R44),3),3,IF(L44=SMALL((C44,F44,I44,L44,O44,R44),4),4,IF(L44=SMALL((C44,F44,I44,L44,O44,R44),5),5,IF(L44=SMALL((C44,F44,I44,L44,O44,R44),6),6)))))))","v":6},{"$f":"IF(ISTEXT(M43),0,7-M43)","v":1},{"$f":"IF(ISERROR(FIND(\"Relay\", $B44)),  IF('Lane 6'!$C41=\"Swimmer\", \"\", 'Lane 6'!$C41), \"Relay\")","v":"H Bottrill"},{"$f":"IF(OR(O44=\"DQ\",O44=\"DNS\"),\"-\",IF(O44=SMALL((C44,F44,I44,L44,O44,R44),1),1,IF(O44=SMALL((C44,F44,I44,L44,O44,R44),2),2,IF(O44=SMALL((C44,F44,I44,L44,O44,R44),3),3,IF(O44=SMALL((C44,F44,I44,L44,O44,R44),4),4,IF(O44=SMALL((C44,F44,I44,L44,O44,R44),5),5,IF(O44=SMALL((C44,F44,I44,L44,O44,R44),6),6)))))))","v":4},{"$f":"IF(ISTEXT(P43),0,7-P43)","v":3},{"$f":"IF(ISERROR(FIND(\"Relay\", $B44)),  IF('Lane 1'!$C41=\"Swimmer\", \"\", 'Lane 1'!$C41), \"Relay\")","v":"Matthew Bowater"},{"$f":"IF(OR(R44=\"DQ\",R44=\"DNS\"),\"-\",IF(R44=SMALL((C44,F44,I44,L44,O44,R44),1),1,IF(R44=SMALL((C44,F44,I44,L44,O44,R44),2),2,IF(R44=SMALL((C44,F44,I44,L44,O44,R44),3),3,IF(R44=SMALL((C44,F44,I44,L44,O44,R44),4),4,IF(R44=SMALL((C44,F44,I44,L44,O44,R44),5),5,IF(R44=SMALL((C44,F44,I44,L44,O44,R44),6),6)))))))","v":5},{"$f":"IF(ISTEXT(S43),0,7-S43)","v":2},{"$f":"T43+Q43+N43+K43+H43+E43","v":21}]
[null,"Backstroke","00:00:40.900",null,{"$f":"E42+E43","v":63},"00:00:37.810",null,{"$f":"H42+H43","v":83},"00:00:44.310",null,{"$f":"K42+K43","v":73},"00:00:53.560",null,{"$f":"N42+N43","v":47},"00:00:45.530",null,{"$f":"Q42+Q43","v":67},"00:00:46.580",null,{"$f":"T42+T43","v":72},null,{"$f":"V42+U43","v":405}]
[21,"G 9 yrs 4 x 1L",{"$f":"IF(ISERROR(FIND(\"Relay\", $B46)),  IF('Lane 2'!$C43=\"Swimmer\", \"\", 'Lane 2'!$C43), \"Relay\")","v":"Relay"},{"$f":"IF(OR(C46=\"DQ\",C46=\"DNS\"),\"-\",IF(C46=SMALL((C46,F46,I46,L46,O46,R46),1),1,IF(C46=SMALL((C46,F46,I46,L46,O46,R46),2),2,IF(C46=SMALL((C46,F46,I46,L46,O46,R46),3),3,IF(C46=SMALL((C46,F46,I46,L46,O46,R46),4),4,IF(C46=SMALL((C46,F46,I46,L46,O46,R46),5),5,IF(C46=SMALL((C46,F46,I46,L46,O46,R46),6),6)))))))","v":4},{"$f":"IF(ISTEXT(D45),0,7-D45)","v":3},{"$f":"IF(ISERROR(FIND(\"Relay\", $B46)),  IF('Lane 3'!$C43=\"Swimmer\", \"\", 'Lane 3'!$C43), \"Relay\")","v":"Relay"},{"$f":"IF(OR(F46=\"DQ\",F46=\"DNS\"),\"-\",IF(F46=SMALL((C46,F46,I46,L46,O46,R46),1),1,IF(F46=SMALL((C46,F46,I46,L46,O46,R46),2),2,IF(F46=SMALL((C46,F46,I46,L46,O46,R46),3),3,IF(F46=SMALL((C46,F46,I46,L46,O46,R46),4),4,IF(F46=SMALL((C46,F46,I46,L46,O46,R46),5),5,IF(F46=SMALL((C46,F46,I46,L46,O46,R46),6),6)))))))","v":2},{"$f":"IF(ISTEXT(G45),0,7-G45)","v":5},{"$f":"IF(ISERROR(FIND(\"Relay\", $B46)),  IF('Lane 4'!$C43=\"Swimmer\", \"\", 'Lane 4'!$C43), \"Relay\")","v":"Relay"},{"$f":"IF(OR(I46=\"DQ\",I46=\"DNS\"),\"-\",IF(I46=SMALL((C46,F46,I46,L46,O46,R46),1),1,IF(I46=SMALL((C46,F46,I46,L46,O46,R46),2),2,IF(I46=SMALL((C46,F46,I46,L46,O46,R46),3),3,IF(I46=SMALL((C46,F46,I46,L46,O46,R46),4),4,IF(I46=SMALL((C46,F46,I46,L46,O46,R46),5),5,IF(I46=SMALL((C46,F46,I46,L46,O46,R46),6),6)))))))","v":3},{"$f":"IF(ISTEXT(J45),0,7-J45)","v":4},{"$f":"IF(ISERROR(FIND(\"Relay\", $B46)),  IF('Lane 5'!$C43=\"Swimmer\", \"\", 'Lane 5'!$C43), \"Relay\")","v":"Relay"},{"$f":"IF(OR(L46=\"DQ\",L46=\"DNS\"),\"-\",IF(L46=SMALL((C46,F46,I46,L46,O46,R46),1),1,IF(L46=SMALL((C46,F46,I46,L46,O46,R46),2),2,IF(L46=SMALL((C46,F46,I46,L46,O46,R46),3),3,IF(L46=SMALL((C46,F46,I46,L46,O46,R46),4),4,IF(L46=SMALL((C46,F46,I46,L46,O46,R46),5),5,IF(L46=SMALL((C46,F46,I46,L46,O46,R46),6),6)))))))","v":"-"},{"$f":"IF(ISTEXT(M45),0,7-M45)","v":0},{"$f":"IF(ISERROR(FIND(\"Relay\", $B46)),  IF('Lane 6'!$C43=\"Swimmer\", \"\", 'Lane 6'!$C43), \"Relay\")","v":"Relay"},{"$f":"IF(OR(O46=\"DQ\",O46=\"DNS\"),\"-\",IF(O46=SMALL((C46,F46,I46,L46,O46,R46),1),1,IF(O46=SMALL((C46,F46,I46,L46,O46,R46),2),2,IF(O46=SMALL((C46,F46,I46,L46,O46,R46),3),3,IF(O46=SMALL((C46,F46,I46,L46,O46,R46),4),4,IF(O46=SMALL((C46,F46,I46,L46,O46,R46),5),5,IF(O46=SMALL((C46,F46,I46,L46,O46,R46),6),6)))))))","v":5},{"$f":"IF(ISTEXT(P45),0,7-P45)","v":2},{"$f":"IF(ISERROR(FIND(\"Relay\", $B46)),  IF('Lane 1'!$D43=\"Swimmer\", \"\", 'Lane 1'!$D43), \"Relay\")","v":"Relay"},{"$f":"IF(OR(R46=\"DQ\",R46=\"DNS\"),\"-\",IF(R46=SMALL((C46,F46,I46,L46,O46,R46),1),1,IF(R46=SMALL((C46,F46,I46,L46,O46,R46),2),2,IF(R46=SMALL((C46,F46,I46,L46,O46,R46),3),3,IF(R46=SMALL((C46,F46,I46,L46,O46,R46),4),4,IF(R46=SMALL((C46,F46,I46,L46,O46,R46),5),5,IF(R46=SMALL((C46,F46,I46,L46,O46,R46),6),6)))))))","v":1},{"$f":"IF(ISTEXT(S45),0,7-S45)","v":6},{"$f":"T45+Q45+N45+K45+H45+E45","v":20}]
[null,"Freestyle Relay","00:01:33.110",null,{"$f":"E44+E45","v":66},"00:01:27.480",null,{"$f":"H44+H45","v":88},"00:01:28.240",null,{"$f":"K44+K45","v":77},"DNS",null,{"$f":"N44+N45","v":47},"00:01:33.210",null,{"$f":"Q44+Q45","v":69},"00:01:25.870",null,{"$f":"T44+T45","v":78},null,{"$f":"V44+U45","v":425}]
[22,"B 9 yrs 4x1L",{"$f":"IF(ISERROR(FIND(\"Relay\", $B48)),  IF('Lane 2'!$C45=\"Swimmer\", \"\", 'Lane 2'!$C45), \"Relay\")","v":"Relay"},{"$f":"IF(OR(C48=\"DQ\",C48=\"DNS\"),\"-\",IF(C48=SMALL((C48,F48,I48,L48,O48,R48),1),1,IF(C48=SMALL((C48,F48,I48,L48,O48,R48),2),2,IF(C48=SMALL((C48,F48,I48,L48,O48,R48),3),3,IF(C48=SMALL((C48,F48,I48,L48,O48,R48),4),4,IF(C48=SMALL((C48,F48,I48,L48,O48,R48),5),5,IF(C48=SMALL((C48,F48,I48,L48,O48,R48),6),6)))))))","v":"-"},{"$f":"IF(ISTEXT(D47),0,7-D47)","v":0},{"$f":"IF(ISERROR(FIND(\"Relay\", $B48)),  IF('Lane 3'!$C45=\"Swimmer\", \"\", 'Lane 3'!$C45), \"Relay\")","v":"Relay"},{"$f":"IF(OR(F48=\"DQ\",F48=\"DNS\"),\"-\",IF(F48=SMALL((C48,F48,I48,L48,O48,R48),1),1,IF(F48=SMALL((C48,F48,I48,L48,O48,R48),2),2,IF(F48=SMALL((C48,F48,I48,L48,O48,R48),3),3,IF(F48=SMALL((C48,F48,I48,L48,O48,R48),4),4,IF(F48=SMALL((C48,F48,I48,L48,O48,R48),5),5,IF(F48=SMALL((C48,F48,I48,L48,O48,R48),6),6)))))))","v":1},{"$f":"IF(ISTEXT(G47),0,7-G47)","v":6},{"$f":"IF(ISERROR(FIND(\"Relay\", $B48)),  IF('Lane 4'!$C45=\"Swimmer\", \"\", 'Lane 4'!$C45), \"Relay\")","v":"Relay"},{"$f":"IF(OR(I48=\"DQ\",I48=\"DNS\"),\"-\",IF(I48=SMALL((C48,F48,I48,L48,O48,R48),1),1,IF(I48=SMALL((C48,F48,I48,L48,O48,R48),2),2,IF(I48=SMALL((C48,F48,I48,L48,O48,R48),3),3,IF(I48=SMALL((C48,F48,I48,L48,O48,R48),4),4,IF(I48=SMALL((C48,F48,I48,L48,O48,R48),5),5,IF(I48=SMALL((C48,F48,I48,L48,O48,R48),6),6)))))))","v":"-"},{"$f":"IF(ISTEXT(J47),0,7-J47)","v":0},{"$f":"IF(ISERROR(FIND(\"Relay\", $B48)),  IF('Lane 5'!$C45=\"Swimmer\", \"\", 'Lane 5'!$C45), \"Relay\")","v":"Relay"},{"$f":"IF(OR(L48=\"DQ\",L48=\"DNS\"),\"-\",IF(L48=SMALL((C48,F48,I48,L48,O48,R48),1),1,IF(L48=SMALL((C48,F48,I48,L48,O48,R48),2),2,IF(L48=SMALL((C48,F48,I48,L48,O48,R48),3),3,IF(L48=SMALL((C48,F48,I48,L48,O48,R48),4),4,IF(L48=SMALL((C48,F48,I48,L48,O48,R48),5),5,IF(L48=SMALL((C48,F48,I48,L48,O48,R48),6),6)))))))","v":"-"},{"$f":"IF(ISTEXT(M47),0,7-M47)","v":0},{"$f":"IF(ISERROR(FIND(\"Relay\", $B48)),  IF('Lane 6'!$C45=\"Swimmer\", \"\", 'Lane 6'!$C45), \"Relay\")","v":"Relay"},{"$f":"IF(OR(O48=\"DQ\",O48=\"DNS\"),\"-\",IF(O48=SMALL((C48,F48,I48,L48,O48,R48),1),1,IF(O48=SMALL((C48,F48,I48,L48,O48,R48),2),2,IF(O48=SMALL((C48,F48,I48,L48,O48,R48),3),3,IF(O48=SMALL((C48,F48,I48,L48,O48,R48),4),4,IF(O48=SMALL((C48,F48,I48,L48,O48,R48),5),5,IF(O48=SMALL((C48,F48,I48,L48,O48,R48),6),6)))))))","v":3},{"$f":"IF(ISTEXT(P47),0,7-P47)","v":4},{"$f":"IF(ISERROR(FIND(\"Relay\", $B48)),  IF('Lane 1'!$D45=\"Swimmer\", \"\", 'Lane 1'!$D45), \"Relay\")","v":"Relay"},{"$f":"IF(OR(R48=\"DQ\",R48=\"DNS\"),\"-\",IF(R48=SMALL((C48,F48,I48,L48,O48,R48),1),1,IF(R48=SMALL((C48,F48,I48,L48,O48,R48),2),2,IF(R48=SMALL((C48,F48,I48,L48,O48,R48),3),3,IF(R48=SMALL((C48,F48,I48,L48,O48,R48),4),4,IF(R48=SMALL((C48,F48,I48,L48,O48,R48),5),5,IF(R48=SMALL((C48,F48,I48,L48,O48,R48),6),6)))))))","v":2},{"$f":"IF(ISTEXT(S47),0,7-S47)","v":5},{"$f":"T47+Q47+N47+K47+H47+E47","v":15}]
[null,"Freestyle Relay","DQ",null,{"$f":"E46+E47","v":66},"00:01:20.170",null,{"$f":"H46+H47","v":94},"DNS",null,{"$f":"K46+K47","v":77},"DNS",null,{"$f":"N46+N47","v":47},"00:01:35.850",null,{"$f":"Q46+Q47","v":73},"00:01:21.060",null,{"$f":"T46+T47","v":83},null,{"$f":"V46+U47","v":440}]
[23,"G 12/u 2L ",{"$f":"IF(ISERROR(FIND(\"Relay\", $B50)),  IF('Lane 2'!$C47=\"Swimmer\", \"\", 'Lane 2'!$C47), \"Relay\")","v":"Libby Wilks"},{"$f":"IF(OR(C50=\"DQ\",C50=\"DNS\"),\"-\",IF(C50=SMALL((C50,F50,I50,L50,O50,R50),1),1,IF(C50=SMALL((C50,F50,I50,L50,O50,R50),2),2,IF(C50=SMALL((C50,F50,I50,L50,O50,R50),3),3,IF(C50=SMALL((C50,F50,I50,L50,O50,R50),4),4,IF(C50=SMALL((C50,F50,I50,L50,O50,R50),5),5,IF(C50=SMALL((C50,F50,I50,L50,O50,R50),6),6)))))))","v":3},{"$f":"IF(ISTEXT(D49),0,7-D49)","v":4},{"$f":"IF(ISERROR(FIND(\"Relay\", $B50)),  IF('Lane 3'!$C47=\"Swimmer\", \"\", 'Lane 3'!$C47), \"Relay\")","v":"Emily Withey"},{"$f":"IF(OR(F50=\"DQ\",F50=\"DNS\"),\"-\",IF(F50=SMALL((C50,F50,I50,L50,O50,R50),1),1,IF(F50=SMALL((C50,F50,I50,L50,O50,R50),2),2,IF(F50=SMALL((C50,F50,I50,L50,O50,R50),3),3,IF(F50=SMALL((C50,F50,I50,L50,O50,R50),4),4,IF(F50=SMALL((C50,F50,I50,L50,O50,R50),5),5,IF(F50=SMALL((C50,F50,I50,L50,O50,R50),6),6)))))))","v":2},{"$f":"IF(ISTEXT(G49),0,7-G49)","v":5},{"$f":"IF(ISERROR(FIND(\"Relay\", $B50)),  IF('Lane 4'!$C47=\"Swimmer\", \"\", 'Lane 4'!$C47), \"Relay\")","v":"Eve Phillips"},{"$f":"IF(OR(I50=\"DQ\",I50=\"DNS\"),\"-\",IF(I50=SMALL((C50,F50,I50,L50,O50,R50),1),1,IF(I50=SMALL((C50,F50,I50,L50,O50,R50),2),2,IF(I50=SMALL((C50,F50,I50,L50,O50,R50),3),3,IF(I50=SMALL((C50,F50,I50,L50,O50,R50),4),4,IF(I50=SMALL((C50,F50,I50,L50,O50,R50),5),5,IF(I50=SMALL((C50,F50,I50,L50,O50,R50),6),6)))))))","v":5},{"$f":"IF(ISTEXT(J49),0,7-J49)","v":2},{"$f":"IF(ISERROR(FIND(\"Relay\", $B50)),  IF('Lane 5'!$C47=\"Swimmer\", \"\", 'Lane 5'!$C47), \"Relay\")","v":"Abigail Tan"},{"$f":"IF(OR(L50=\"DQ\",L50=\"DNS\"),\"-\",IF(L50=SMALL((C50,F50,I50,L50,O50,R50),1),1,IF(L50=SMALL((C50,F50,I50,L50,O50,R50),2),2,IF(L50=SMALL((C50,F50,I50,L50,O50,R50),3),3,IF(L50=SMALL((C50,F50,I50,L50,O50,R50),4),4,IF(L50=SMALL((C50,F50,I50,L50,O50,R50),5),5,IF(L50=SMALL((C50,F50,I50,L50,O50,R50),6),6)))))))","v":1},{"$f":"IF(ISTEXT(M49),0,7-M49)","v":6},{"$f":"IF(ISERROR(FIND(\"Relay\", $B50)),  IF('Lane 6'!$C47=\"Swimmer\", \"\", 'Lane 6'!$C47), \"Relay\")","v":"E Rollins"},{"$f":"IF(OR(O50=\"DQ\",O50=\"DNS\"),\"-\",IF(O50=SMALL((C50,F50,I50,L50,O50,R50),1),1,IF(O50=SMALL((C50,F50,I50,L50,O50,R50),2),2,IF(O50=SMALL((C50,F50,I50,L50,O50,R50),3),3,IF(O50=SMALL((C50,F50,I50,L50,O50,R50),4),4,IF(O50=SMALL((C50,F50,I50,L50,O50,R50),5),5,IF(O50=SMALL((C50,F50,I50,L50,O50,R50),6),6)))))))","v":"-"},{"$f":"IF(ISTEXT(P49),0,7-P49)","v":0},{"$f":"IF(ISERROR(FIND(\"Relay\", $B50)),  IF('Lane 1'!$C47=\"Swimmer\", \"\", 'Lane 1'!$C47), \"Relay\")","v":"Olivia Samuels"},{"$f":"IF(OR(R50=\"DQ\",R50=\"DNS\"),\"-\",IF(R50=SMALL((C50,F50,I50,L50,O50,R50),1),1,IF(R50=SMALL((C50,F50,I50,L50,O50,R50),2),2,IF(R50=SMALL((C50,F50,I50,L50,O50,R50),3),3,IF(R50=SMALL((C50,F50,I50,L50,O50,R50),4),4,IF(R50=SMALL((C50,F50,I50,L50,O50,R50),5),5,IF(R50=SMALL((C50,F50,I50,L50,O50,R50),6),6)))))))","v":4},{"$f":"IF(ISTEXT(S49),0,7-S49)","v":3},{"$f":"T49+Q49+N49+K49+H49+E49","v":20}]
[null,"Breaststroke","00:00:48.440",null,{"$f":"E48+E49","v":70},"00:00:47.380",null,{"$f":"H48+H49","v":99},"00:00:51.950",null,{"$f":"K48+K49","v":79},"00:00:39.310",null,{"$f":"N48+N49","v":53},"DQ",null,{"$f":"Q48+Q49","v":73},"00:00:50.440",null,{"$f":"T48+T49","v":86},null,{"$f":"V48+U49","v":460}]
[24,"B 12/u 2L",{"$f":"IF(ISERROR(FIND(\"Relay\", $B52)),  IF('Lane 2'!$C49=\"Swimmer\", \"\", 'Lane 2'!$C49), \"Relay\")","v":"Lachlin Woodend"},{"$f":"IF(OR(C52=\"DQ\",C52=\"DNS\"),\"-\",IF(C52=SMALL((C52,F52,I52,L52,O52,R52),1),1,IF(C52=SMALL((C52,F52,I52,L52,O52,R52),2),2,IF(C52=SMALL((C52,F52,I52,L52,O52,R52),3),3,IF(C52=SMALL((C52,F52,I52,L52,O52,R52),4),4,IF(C52=SMALL((C52,F52,I52,L52,O52,R52),5),5,IF(C52=SMALL((C52,F52,I52,L52,O52,R52),6),6)))))))","v":5},{"$f":"IF(ISTEXT(D51),0,7-D51)","v":2},{"$f":"IF(ISERROR(FIND(\"Relay\", $B52)),  IF('Lane 3'!$C49=\"Swimmer\", \"\", 'Lane 3'!$C49), \"Relay\")","v":"Harvey Ashead"},{"$f":"IF(OR(F52=\"DQ\",F52=\"DNS\"),\"-\",IF(F52=SMALL((C52,F52,I52,L52,O52,R52),1),1,IF(F52=SMALL((C52,F52,I52,L52,O52,R52),2),2,IF(F52=SMALL((C52,F52,I52,L52,O52,R52),3),3,IF(F52=SMALL((C52,F52,I52,L52,O52,R52),4),4,IF(F52=SMALL((C52,F52,I52,L52,O52,R52),5),5,IF(F52=SMALL((C52,F52,I52,L52,O52,R52),6),6)))))))","v":2},{"$f":"IF(ISTEXT(G51),0,7-G51)","v":5},{"$f":"IF(ISERROR(FIND(\"Relay\", $B52)),  IF('Lane 4'!$C49=\"Swimmer\", \"\", 'Lane 4'!$C49), \"Relay\")","v":"Dylan Abulencia"},{"$f":"IF(OR(I52=\"DQ\",I52=\"DNS\"),\"-\",IF(I52=SMALL((C52,F52,I52,L52,O52,R52),1),1,IF(I52=SMALL((C52,F52,I52,L52,O52,R52),2),2,IF(I52=SMALL((C52,F52,I52,L52,O52,R52),3),3,IF(I52=SMALL((C52,F52,I52,L52,O52,R52),4),4,IF(I52=SMALL((C52,F52,I52,L52,O52,R52),5),5,IF(I52=SMALL((C52,F52,I52,L52,O52,R52),6),6)))))))","v":1},{"$f":"IF(ISTEXT(J51),0,7-J51)","v":6},{"$f":"IF(ISERROR(FIND(\"Relay\", $B52)),  IF('Lane 5'!$C49=\"Swimmer\", \"\", 'Lane 5'!$C49), \"Relay\")","v":"Michael Dutton"},{"$f":"IF(OR(L52=\"DQ\",L52=\"DNS\"),\"-\",IF(L52=SMALL((C52,F52,I52,L52,O52,R52),1),1,IF(L52=SMALL((C52,F52,I52,L52,O52,R52),2),2,IF(L52=SMALL((C52,F52,I52,L52,O52,R52),3),3,IF(L52=SMALL((C52,F52,I52,L52,O52,R52),4),4,IF(L52=SMALL((C52,F52,I52,L52,O52,R52),5),5,IF(L52=SMALL((C52,F52,I52,L52,O52,R52),6),6)))))))","v":6},{"$f":"IF(ISTEXT(M51),0,7-M51)","v":1},{"$f":"IF(ISERROR(FIND(\"Relay\", $B52)),  IF('Lane 6'!$C49=\"Swimmer\", \"\", 'Lane 6'!$C49), \"Relay\")","v":"C Fletcher"},{"$f":"IF(OR(O52=\"DQ\",O52=\"DNS\"),\"-\",IF(O52=SMALL((C52,F52,I52,L52,O52,R52),1),1,IF(O52=SMALL((C52,F52,I52,L52,O52,R52),2),2,IF(O52=SMALL((C52,F52,I52,L52,O52,R52),3),3,IF(O52=SMALL((C52,F52,I52,L52,O52,R52),4),4,IF(O52=SMALL((C52,F52,I52,L52,O52,R52),5),5,IF(O52=SMALL((C52,F52,I52,L52,O52,R52),6),6)))))))","v":4},{"$f":"IF(ISTEXT(P51),0,7-P51)","v":3},{"$f":"IF(ISERROR(FIND(\"Relay\", $B52)),  IF('Lane 1'!$C49=\"Swimmer\", \"\", 'Lane 1'!$C49), \"Relay\")","v":"Harvie Lal"},{"$f":"IF(OR(R52=\"DQ\",R52=\"DNS\"),\"-\",IF(R52=SMALL((C52,F52,I52,L52,O52,R52),1),1,IF(R52=SMALL((C52,F52,I52,L52,O52,R52),2),2,IF(R52=SMALL((C52,F52,I52,L52,O52,R52),3),3,IF(R52=SMALL((C52,F52,I52,L52,O52,R52),4),4,IF(R52=SMALL((C52,F52,I52,L52,O52,R52),5),5,IF(R52=SMALL((C52,F52,I52,L52,O52,R52),6),6)))))))","v":3},{"$f":"IF(ISTEXT(S51),0,7-S51)","v":4},{"$f":"T51+Q51+N51+K51+H51+E51","v":21}]
[null,"Breaststroke","00:00:50.040",null,{"$f":"E50+E51","v":72},"00:00:43.610",null,{"$f":"H50+H51","v":104},"00:00:40.240",null,{"$f":"K50+K51","v":85},"00:00:55.120",null,{"$f":"N50+N51","v":54},"00:00:49.940",null,{"$f":"Q50+Q51","v":76},"00:00:46.190",null,{"$f":"T50+T51","v":90},null,{"$f":"V50+U51","v":481}]
[25,"G 10yrs 4 x 1L",{"$f":"IF(ISERROR(FIND(\"Relay\", $B54)),  IF('Lane 2'!$C51=\"Swimmer\", \"\", 'Lane 2'!$C51), \"Relay\")","v":"Relay"},{"$f":"IF(OR(C54=\"DQ\",C54=\"DNS\"),\"-\",IF(C54=SMALL((C54,F54,I54,L54,O54,R54),1),1,IF(C54=SMALL((C54,F54,I54,L54,O54,R54),2),2,IF(C54=SMALL((C54,F54,I54,L54,O54,R54),3),3,IF(C54=SMALL((C54,F54,I54,L54,O54,R54),4),4,IF(C54=SMALL((C54,F54,I54,L54,O54,R54),5),5,IF(C54=SMALL((C54,F54,I54,L54,O54,R54),6),6)))))))","v":2},{"$f":"IF(ISTEXT(D53),0,7-D53)","v":5},{"$f":"IF(ISERROR(FIND(\"Relay\", $B54)),  IF('Lane 3'!$C51=\"Swimmer\", \"\", 'Lane 3'!$C51), \"Relay\")","v":"Relay"},{"$f":"IF(OR(F54=\"DQ\",F54=\"DNS\"),\"-\",IF(F54=SMALL((C54,F54,I54,L54,O54,R54),1),1,IF(F54=SMALL((C54,F54,I54,L54,O54,R54),2),2,IF(F54=SMALL((C54,F54,I54,L54,O54,R54),3),3,IF(F54=SMALL((C54,F54,I54,L54,O54,R54),4),4,IF(F54=SMALL((C54,F54,I54,L54,O54,R54),5),5,IF(F54=SMALL((C54,F54,I54,L54,O54,R54),6),6)))))))","v":1},{"$f":"IF(ISTEXT(G53),0,7-G53)","v":6},{"$f":"IF(ISERROR(FIND(\"Relay\", $B54)),  IF('Lane 4'!$C51=\"Swimmer\", \"\", 'Lane 4'!$C51), \"Relay\")","v":"Relay"},{"$f":"IF(OR(I54=\"DQ\",I54=\"DNS\"),\"-\",IF(I54=SMALL((C54,F54,I54,L54,O54,R54),1),1,IF(I54=SMALL((C54,F54,I54,L54,O54,R54),2),2,IF(I54=SMALL((C54,F54,I54,L54,O54,R54),3),3,IF(I54=SMALL((C54,F54,I54,L54,O54,R54),4),4,IF(I54=SMALL((C54,F54,I54,L54,O54,R54),5),5,IF(I54=SMALL((C54,F54,I54,L54,O54,R54),6),6)))))))","v":4},{"$f":"IF(ISTEXT(J53),0,7-J53)","v":3},{"$f":"IF(ISERROR(FIND(\"Relay\", $B54)),  IF('Lane 5'!$C51=\"Swimmer\", \"\", 'Lane 5'!$C51), \"Relay\")","v":"Relay"},{"$f":"IF(OR(L54=\"DQ\",L54=\"DNS\"),\"-\",IF(L54=SMALL((C54,F54,I54,L54,O54,R54),1),1,IF(L54=SMALL((C54,F54,I54,L54,O54,R54),2),2,IF(L54=SMALL((C54,F54,I54,L54,O54,R54),3),3,IF(L54=SMALL((C54,F54,I54,L54,O54,R54),4),4,IF(L54=SMALL((C54,F54,I54,L54,O54,R54),5),5,IF(L54=SMALL((C54,F54,I54,L54,O54,R54),6),6)))))))","v":"-"},{"$f":"IF(ISTEXT(M53),0,7-M53)","v":0},{"$f":"IF(ISERROR(FIND(\"Relay\", $B54)),  IF('Lane 6'!$C51=\"Swimmer\", \"\", 'Lane 6'!$C51), \"Relay\")","v":"Relay"},{"$f":"IF(OR(O54=\"DQ\",O54=\"DNS\"),\"-\",IF(O54=SMALL((C54,F54,I54,L54,O54,R54),1),1,IF(O54=SMALL((C54,F54,I54,L54,O54,R54),2),2,IF(O54=SMALL((C54,F54,I54,L54,O54,R54),3),3,IF(O54=SMALL((C54,F54,I54,L54,O54,R54),4),4,IF(O54=SMALL((C54,F54,I54,L54,O54,R54),5),5,IF(O54=SMALL((C54,F54,I54,L54,O54,R54),6),6)))))))","v":5},{"$f":"IF(ISTEXT(P53),0,7-P53)","v":2},{"$f":"IF(ISERROR(FIND(\"Relay\", $B54)),  IF('Lane 1'!$D51=\"Swimmer\", \"\", 'Lane 1'!$D51), \"Relay\")","v":"Relay"},{"$f":"IF(OR(R54=\"DQ\",R54=\"DNS\"),\"-\",IF(R54=SMALL((C54,F54,I54,L54,O54,R54),1),1,IF(R54=SMALL((C54,F54,I54,L54,O54,R54),2),2,IF(R54=SMALL((C54,F54,I54,L54,O54,R54),3),3,IF(R54=SMALL((C54,F54,I54,L54,O54,R54),4),4,IF(R54=SMALL((C54,F54,I54,L54,O54,R54),5),5,IF(R54=SMALL((C54,F54,I54,L54,O54,R54),6),6)))))))","v":3},{"$f":"IF(ISTEXT(S53),0,7-S53)","v":4},{"$f":"T53+Q53+N53+K53+H53+E53","v":20}]
[null,"Freestyle Relay","00:01:15.870",null,{"$f":"E52+E53","v":77},"00:01:15.680",null,{"$f":"H52+H53","v":110},"00:01:24.440",null,{"$f":"K52+K53","v":88},"DQ",null,{"$f":"N52+N53","v":54},"00:01:43.410",null,{"$f":"Q52+Q53","v":78},"00:01:20.930",null,{"$f":"T52+T53","v":94},null,{"$f":"V52+U53","v":501}]
[26,"B 10yrs 4 x 1L",{"$f":"IF(ISERROR(FIND(\"Relay\", $B56)),  IF('Lane 2'!$C53=\"Swimmer\", \"\", 'Lane 2'!$C53), \"Relay\")","v":"Relay"},{"$f":"IF(OR(C56=\"DQ\",C56=\"DNS\"),\"-\",IF(C56=SMALL((C56,F56,I56,L56,O56,R56),1),1,IF(C56=SMALL((C56,F56,I56,L56,O56,R56),2),2,IF(C56=SMALL((C56,F56,I56,L56,O56,R56),3),3,IF(C56=SMALL((C56,F56,I56,L56,O56,R56),4),4,IF(C56=SMALL((C56,F56,I56,L56,O56,R56),5),5,IF(C56=SMALL((C56,F56,I56,L56,O56,R56),6),6)))))))","v":"-"},{"$f":"IF(ISTEXT(D55),0,7-D55)","v":0},{"$f":"IF(ISERROR(FIND(\"Relay\", $B56)),  IF('Lane 3'!$C53=\"Swimmer\", \"\", 'Lane 3'!$C53), \"Relay\")","v":"Relay"},{"$f":"IF(OR(F56=\"DQ\",F56=\"DNS\"),\"-\",IF(F56=SMALL((C56,F56,I56,L56,O56,R56),1),1,IF(F56=SMALL((C56,F56,I56,L56,O56,R56),2),2,IF(F56=SMALL((C56,F56,I56,L56,O56,R56),3),3,IF(F56=SMALL((C56,F56,I56,L56,O56,R56),4),4,IF(F56=SMALL((C56,F56,I56,L56,O56,R56),5),5,IF(F56=SMALL((C56,F56,I56,L56,O56,R56),6),6)))))))","v":2},{"$f":"IF(ISTEXT(G55),0,7-G55)","v":5},{"$f":"IF(ISERROR(FIND(\"Relay\", $B56)),  IF('Lane 4'!$C53=\"Swimmer\", \"\", 'Lane 4'!$C53), \"Relay\")","v":"Relay"},{"$f":"IF(OR(I56=\"DQ\",I56=\"DNS\"),\"-\",IF(I56=SMALL((C56,F56,I56,L56,O56,R56),1),1,IF(I56=SMALL((C56,F56,I56,L56,O56,R56),2),2,IF(I56=SMALL((C56,F56,I56,L56,O56,R56),3),3,IF(I56=SMALL((C56,F56,I56,L56,O56,R56),4),4,IF(I56=SMALL((C56,F56,I56,L56,O56,R56),5),5,IF(I56=SMALL((C56,F56,I56,L56,O56,R56),6),6)))))))","v":3},{"$f":"IF(ISTEXT(J55),0,7-J55)","v":4},{"$f":"IF(ISERROR(FIND(\"Relay\", $B56)),  IF('Lane 5'!$C53=\"Swimmer\", \"\", 'Lane 5'!$C53), \"Relay\")","v":"Relay"},{"$f":"IF(OR(L56=\"DQ\",L56=\"DNS\"),\"-\",IF(L56=SMALL((C56,F56,I56,L56,O56,R56),1),1,IF(L56=SMALL((C56,F56,I56,L56,O56,R56),2),2,IF(L56=SMALL((C56,F56,I56,L56,O56,R56),3),3,IF(L56=SMALL((C56,F56,I56,L56,O56,R56),4),4,IF(L56=SMALL((C56,F56,I56,L56,O56,R56),5),5,IF(L56=SMALL((C56,F56,I56,L56,O56,R56),6),6)))))))","v":"-"},{"$f":"IF(ISTEXT(M55),0,7-M55)","v":0},{"$f":"IF(ISERROR(FIND(\"Relay\", $B56)),  IF('Lane 6'!$C53=\"Swimmer\", \"\", 'Lane 6'!$C53), \"Relay\")","v":"Relay"},{"$f":"IF(OR(O56=\"DQ\",O56=\"DNS\"),\"-\",IF(O56=SMALL((C56,F56,I56,L56,O56,R56),1),1,IF(O56=SMALL((C56,F56,I56,L56,O56,R56),2),2,IF(O56=SMALL((C56,F56,I56,L56,O56,R56),3),3,IF(O56=SMALL((C56,F56,I56,L56,O56,R56),4),4,IF(O56=SMALL((C56,F56,I56,L56,O56,R56),5),5,IF(O56=SMALL((C56,F56,I56,L56,O56,R56),6),6)))))))","v":1},{"$f":"IF(ISTEXT(P55),0,7-P55)","v":6},{"$f":"IF(ISERROR(FIND(\"Relay\", $B56)),  IF('Lane 1'!$D53=\"Swimmer\", \"\", 'Lane 1'!$D53), \"Relay\")","v":"Relay"},{"$f":"IF(OR(R56=\"DQ\",R56=\"DNS\"),\"-\",IF(R56=SMALL((C56,F56,I56,L56,O56,R56),1),1,IF(R56=SMALL((C56,F56,I56,L56,O56,R56),2),2,IF(R56=SMALL((C56,F56,I56,L56,O56,R56),3),3,IF(R56=SMALL((C56,F56,I56,L56,O56,R56),4),4,IF(R56=SMALL((C56,F56,I56,L56,O56,R56),5),5,IF(R56=SMALL((C56,F56,I56,L56,O56,R56),6),6)))))))","v":4},{"$f":"IF(ISTEXT(S55),0,7-S55)","v":3},{"$f":"T55+Q55+N55+K55+H55+E55","v":18}]
[null,"Freestyle Relay","DQ",null,{"$f":"E54+E55","v":77},"00:01:15.760",null,{"$f":"H54+H55","v":115},"00:01:19.010",null,{"$f":"K54+K55","v":92},"DNS",null,{"$f":"N54+N55","v":54},"00:01:14.750",null,{"$f":"Q54+Q55","v":84},"00:01:22.360",null,{"$f":"T54+T55","v":97},null,{"$f":"V54+U55","v":519}]
[27,"G 11/u 2L",{"$f":"IF(ISERROR(FIND(\"Relay\", $B58)),  IF('Lane 2'!$C55=\"Swimmer\", \"\", 'Lane 2'!$C55), \"Relay\")","v":"Isobelle Carpenter-Clay"},{"$f":"IF(OR(C58=\"DQ\",C58=\"DNS\"),\"-\",IF(C58=SMALL((C58,F58,I58,L58,O58,R58),1),1,IF(C58=SMALL((C58,F58,I58,L58,O58,R58),2),2,IF(C58=SMALL((C58,F58,I58,L58,O58,R58),3),3,IF(C58=SMALL((C58,F58,I58,L58,O58,R58),4),4,IF(C58=SMALL((C58,F58,I58,L58,O58,R58),5),5,IF(C58=SMALL((C58,F58,I58,L58,O58,R58),6),6)))))))","v":2},{"$f":"IF(ISTEXT(D57),0,7-D57)","v":5},{"$f":"IF(ISERROR(FIND(\"Relay\", $B58)),  IF('Lane 3'!$C55=\"Swimmer\", \"\", 'Lane 3'!$C55), \"Relay\")","v":"Sarah Hunt"},{"$f":"IF(OR(F58=\"DQ\",F58=\"DNS\"),\"-\",IF(F58=SMALL((C58,F58,I58,L58,O58,R58),1),1,IF(F58=SMALL((C58,F58,I58,L58,O58,R58),2),2,IF(F58=SMALL((C58,F58,I58,L58,O58,R58),3),3,IF(F58=SMALL((C58,F58,I58,L58,O58,R58),4),4,IF(F58=SMALL((C58,F58,I58,L58,O58,R58),5),5,IF(F58=SMALL((C58,F58,I58,L58,O58,R58),6),6)))))))","v":4},{"$f":"IF(ISTEXT(G57),0,7-G57)","v":3},{"$f":"IF(ISERROR(FIND(\"Relay\", $B58)),  IF('Lane 4'!$C55=\"Swimmer\", \"\", 'Lane 4'!$C55), \"Relay\")","v":"Eleanor Ribchester"},{"$f":"IF(OR(I58=\"DQ\",I58=\"DNS\"),\"-\",IF(I58=SMALL((C58,F58,I58,L58,O58,R58),1),1,IF(I58=SMALL((C58,F58,I58,L58,O58,R58),2),2,IF(I58=SMALL((C58,F58,I58,L58,O58,R58),3),3,IF(I58=SMALL((C58,F58,I58,L58,O58,R58),4),4,IF(I58=SMALL((C58,F58,I58,L58,O58,R58),5),5,IF(I58=SMALL((C58,F58,I58,L58,O58,R58),6),6)))))))","v":3},{"$f":"IF(ISTEXT(J57),0,7-J57)","v":4},{"$f":"IF(ISERROR(FIND(\"Relay\", $B58)),  IF('Lane 5'!$C55=\"Swimmer\", \"\", 'Lane 5'!$C55), \"Relay\")","v":""},{"$f":"IF(OR(L58=\"DQ\",L58=\"DNS\"),\"-\",IF(L58=SMALL((C58,F58,I58,L58,O58,R58),1),1,IF(L58=SMALL((C58,F58,I58,L58,O58,R58),2),2,IF(L58=SMALL((C58,F58,I58,L58,O58,R58),3),3,IF(L58=SMALL((C58,F58,I58,L58,O58,R58),4),4,IF(L58=SMALL((C58,F58,I58,L58,O58,R58),5),5,IF(L58=SMALL((C58,F58,I58,L58,O58,R58),6),6)))))))","v":"-"},{"$f":"IF(ISTEXT(M57),0,7-M57)","v":0},{"$f":"IF(ISERROR(FIND(\"Relay\", $B58)),  IF('Lane 6'!$C55=\"Swimmer\", \"\", 'Lane 6'!$C55), \"Relay\")","v":"E Hendon"},{"$f":"IF(OR(O58=\"DQ\",O58=\"DNS\"),\"-\",IF(O58=SMALL((C58,F58,I58,L58,O58,R58),1),1,IF(O58=SMALL((C58,F58,I58,L58,O58,R58),2),2,IF(O58=SMALL((C58,F58,I58,L58,O58,R58),3),3,IF(O58=SMALL((C58,F58,I58,L58,O58,R58),4),4,IF(O58=SMALL((C58,F58,I58,L58,O58,R58),5),5,IF(O58=SMALL((C58,F58,I58,L58,O58,R58),6),6)))))))","v":1},{"$f":"IF(ISTEXT(P57),0,7-P57)","v":6},{"$f":"IF(ISERROR(FIND(\"Relay\", $B58)),  IF('Lane 1'!$C55=\"Swimmer\", \"\", 'Lane 1'!$C55), \"Relay\")","v":"00:00:00"},{"$f":"IF(OR(R58=\"DQ\",R58=\"DNS\"),\"-\",IF(R58=SMALL((C58,F58,I58,L58,O58,R58),1),1,IF(R58=SMALL((C58,F58,I58,L58,O58,R58),2),2,IF(R58=SMALL((C58,F58,I58,L58,O58,R58),3),3,IF(R58=SMALL((C58,F58,I58,L58,O58,R58),4),4,IF(R58=SMALL((C58,F58,I58,L58,O58,R58),5),5,IF(R58=SMALL((C58,F58,I58,L58,O58,R58),6),6)))))))","v":"-"},{"$f":"IF(ISTEXT(S57),0,7-S57)","v":0},{"$f":"T57+Q57+N57+K57+H57+E57","v":18}]
[null,"Butterfly","00:00:48.470",null,{"$f":"E56+E57","v":82},"00:00:53.940",null,{"$f":"H56+H57","v":118},"00:00:50.170",null,{"$f":"K56+K57","v":96},"DNS",null,{"$f":"N56+N57","v":54},"00:00:46.750",null,{"$f":"Q56+Q57","v":90},"DNS",null,{"$f":"T56+T57","v":97},null,{"$f":"V56+U57","v":537}]
[28,"B 11/u 2L",{"$f":"IF(ISERROR(FIND(\"Relay\", $B60)),  IF('Lane 2'!$C57=\"Swimmer\", \"\", 'Lane 2'!$C57), \"Relay\")","v":"Alex Walker"},{"$f":"IF(OR(C60=\"DQ\",C60=\"DNS\"),\"-\",IF(C60=SMALL((C60,F60,I60,L60,O60,R60),1),1,IF(C60=SMALL((C60,F60,I60,L60,O60,R60),2),2,IF(C60=SMALL((C60,F60,I60,L60,O60,R60),3),3,IF(C60=SMALL((C60,F60,I60,L60,O60,R60),4),4,IF(C60=SMALL((C60,F60,I60,L60,O60,R60),5),5,IF(C60=SMALL((C60,F60,I60,L60,O60,R60),6),6)))))))","v":5},{"$f":"IF(ISTEXT(D59),0,7-D59)","v":2},{"$f":"IF(ISERROR(FIND(\"Relay\", $B60)),  IF('Lane 3'!$C57=\"Swimmer\", \"\", 'Lane 3'!$C57), \"Relay\")","v":"Reece Johnson"},{"$f":"IF(OR(F60=\"DQ\",F60=\"DNS\"),\"-\",IF(F60=SMALL((C60,F60,I60,L60,O60,R60),1),1,IF(F60=SMALL((C60,F60,I60,L60,O60,R60),2),2,IF(F60=SMALL((C60,F60,I60,L60,O60,R60),3),3,IF(F60=SMALL((C60,F60,I60,L60,O60,R60),4),4,IF(F60=SMALL((C60,F60,I60,L60,O60,R60),5),5,IF(F60=SMALL((C60,F60,I60,L60,O60,R60),6),6)))))))","v":2},{"$f":"IF(ISTEXT(G59),0,7-G59)","v":5},{"$f":"IF(ISERROR(FIND(\"Relay\", $B60)),  IF('Lane 4'!$C57=\"Swimmer\", \"\", 'Lane 4'!$C57), \"Relay\")","v":"Sonny Butcher"},{"$f":"IF(OR(I60=\"DQ\",I60=\"DNS\"),\"-\",IF(I60=SMALL((C60,F60,I60,L60,O60,R60),1),1,IF(I60=SMALL((C60,F60,I60,L60,O60,R60),2),2,IF(I60=SMALL((C60,F60,I60,L60,O60,R60),3),3,IF(I60=SMALL((C60,F60,I60,L60,O60,R60),4),4,IF(I60=SMALL((C60,F60,I60,L60,O60,R60),5),5,IF(I60=SMALL((C60,F60,I60,L60,O60,R60),6),6)))))))","v":6},{"$f":"IF(ISTEXT(J59),0,7-J59)","v":1},{"$f":"IF(ISERROR(FIND(\"Relay\", $B60)),  IF('Lane 5'!$C57=\"Swimmer\", \"\", 'Lane 5'!$C57), \"Relay\")","v":"Issac Walton"},{"$f":"IF(OR(L60=\"DQ\",L60=\"DNS\"),\"-\",IF(L60=SMALL((C60,F60,I60,L60,O60,R60),1),1,IF(L60=SMALL((C60,F60,I60,L60,O60,R60),2),2,IF(L60=SMALL((C60,F60,I60,L60,O60,R60),3),3,IF(L60=SMALL((C60,F60,I60,L60,O60,R60),4),4,IF(L60=SMALL((C60,F60,I60,L60,O60,R60),5),5,IF(L60=SMALL((C60,F60,I60,L60,O60,R60),6),6)))))))","v":4},{"$f":"IF(ISTEXT(M59),0,7-M59)","v":3},{"$f":"IF(ISERROR(FIND(\"Relay\", $B60)),  IF('Lane 6'!$C57=\"Swimmer\", \"\", 'Lane 6'!$C57), \"Relay\")","v":"B Webb"},{"$f":"IF(OR(O60=\"DQ\",O60=\"DNS\"),\"-\",IF(O60=SMALL((C60,F60,I60,L60,O60,R60),1),1,IF(O60=SMALL((C60,F60,I60,L60,O60,R60),2),2,IF(O60=SMALL((C60,F60,I60,L60,O60,R60),3),3,IF(O60=SMALL((C60,F60,I60,L60,O60,R60),4),4,IF(O60=SMALL((C60,F60,I60,L60,O60,R60),5),5,IF(O60=SMALL((C60,F60,I60,L60,O60,R60),6),6)))))))","v":1},{"$f":"IF(ISTEXT(P59),0,7-P59)","v":6},{"$f":"IF(ISERROR(FIND(\"Relay\", $B60)),  IF('Lane 1'!$C57=\"Swimmer\", \"\", 'Lane 1'!$C57), \"Relay\")","v":"Tom Lucas"},{"$f":"IF(OR(R60=\"DQ\",R60=\"DNS\"),\"-\",IF(R60=SMALL((C60,F60,I60,L60,O60,R60),1),1,IF(R60=SMALL((C60,F60,I60,L60,O60,R60),2),2,IF(R60=SMALL((C60,F60,I60,L60,O60,R60),3),3,IF(R60=SMALL((C60,F60,I60,L60,O60,R60),4),4,IF(R60=SMALL((C60,F60,I60,L60,O60,R60),5),5,IF(R60=SMALL((C60,F60,I60,L60,O60,R60),6),6)))))))","v":3},{"$f":"IF(ISTEXT(S59),0,7-S59)","v":4},{"$f":"T59+Q59+N59+K59+H59+E59","v":21}]
[null,"Butterfly","00:00:45.370",null,{"$f":"E58+E59","v":84},"00:00:41.290",null,{"$f":"H58+H59","v":123},"00:00:51.200",null,{"$f":"K58+K59","v":97},"00:00:43.190",null,{"$f":"N58+N59","v":57},"00:00:38.720",null,{"$f":"Q58+Q59","v":96},"00:00:42.900",null,{"$f":"T58+T59","v":101},null,{"$f":"V58+U59","v":558}]
[29,"G 9 yrs 1L",{"$f":"IF(ISERROR(FIND(\"Relay\", $B62)),  IF('Lane 2'!$C59=\"Swimmer\", \"\", 'Lane 2'!$C59), \"Relay\")","v":"Emilia Skelding"},{"$f":"IF(OR(C62=\"DQ\",C62=\"DNS\"),\"-\",IF(C62=SMALL((C62,F62,I62,L62,O62,R62),1),1,IF(C62=SMALL((C62,F62,I62,L62,O62,R62),2),2,IF(C62=SMALL((C62,F62,I62,L62,O62,R62),3),3,IF(C62=SMALL((C62,F62,I62,L62,O62,R62),4),4,IF(C62=SMALL((C62,F62,I62,L62,O62,R62),5),5,IF(C62=SMALL((C62,F62,I62,L62,O62,R62),6),6)))))))","v":4},{"$f":"IF(ISTEXT(D61),0,7-D61)","v":3},{"$f":"IF(ISERROR(FIND(\"Relay\", $B62)),  IF('Lane 3'!$C59=\"Swimmer\", \"\", 'Lane 3'!$C59), \"Relay\")","v":"Esther McGeough"},{"$f":"IF(OR(F62=\"DQ\",F62=\"DNS\"),\"-\",IF(F62=SMALL((C62,F62,I62,L62,O62,R62),1),1,IF(F62=SMALL((C62,F62,I62,L62,O62,R62),2),2,IF(F62=SMALL((C62,F62,I62,L62,O62,R62),3),3,IF(F62=SMALL((C62,F62,I62,L62,O62,R62),4),4,IF(F62=SMALL((C62,F62,I62,L62,O62,R62),5),5,IF(F62=SMALL((C62,F62,I62,L62,O62,R62),6),6)))))))","v":1},{"$f":"IF(ISTEXT(G61),0,7-G61)","v":6},{"$f":"IF(ISERROR(FIND(\"Relay\", $B62)),  IF('Lane 4'!$C59=\"Swimmer\", \"\", 'Lane 4'!$C59), \"Relay\")","v":"Constance Gwillim"},{"$f":"IF(OR(I62=\"DQ\",I62=\"DNS\"),\"-\",IF(I62=SMALL((C62,F62,I62,L62,O62,R62),1),1,IF(I62=SMALL((C62,F62,I62,L62,O62,R62),2),2,IF(I62=SMALL((C62,F62,I62,L62,O62,R62),3),3,IF(I62=SMALL((C62,F62,I62,L62,O62,R62),4),4,IF(I62=SMALL((C62,F62,I62,L62,O62,R62),5),5,IF(I62=SMALL((C62,F62,I62,L62,O62,R62),6),6)))))))","v":2},{"$f":"IF(ISTEXT(J61),0,7-J61)","v":5},null,{"$f":"IF(OR(L62=\"DQ\",L62=\"DNS\"),\"-\",IF(L62=SMALL((C62,F62,I62,L62,O62,R62),1),1,IF(L62=SMALL((C62,F62,I62,L62,O62,R62),2),2,IF(L62=SMALL((C62,F62,I62,L62,O62,R62),3),3,IF(L62=SMALL((C62,F62,I62,L62,O62,R62),4),4,IF(L62=SMALL((C62,F62,I62,L62,O62,R62),5),5,IF(L62=SMALL((C62,F62,I62,L62,O62,R62),6),6)))))))","v":6},{"$f":"IF(ISTEXT(M61),0,7-M61)","v":1},{"$f":"IF(ISERROR(FIND(\"Relay\", $B62)),  IF('Lane 6'!$C59=\"Swimmer\", \"\", 'Lane 6'!$C59), \"Relay\")","v":"K Bell"},{"$f":"IF(OR(O62=\"DQ\",O62=\"DNS\"),\"-\",IF(O62=SMALL((C62,F62,I62,L62,O62,R62),1),1,IF(O62=SMALL((C62,F62,I62,L62,O62,R62),2),2,IF(O62=SMALL((C62,F62,I62,L62,O62,R62),3),3,IF(O62=SMALL((C62,F62,I62,L62,O62,R62),4),4,IF(O62=SMALL((C62,F62,I62,L62,O62,R62),5),5,IF(O62=SMALL((C62,F62,I62,L62,O62,R62),6),6)))))))","v":5},{"$f":"IF(ISTEXT(P61),0,7-P61)","v":2},{"$f":"IF(ISERROR(FIND(\"Relay\", $B62)),  IF('Lane 1'!$C59=\"Swimmer\", \"\", 'Lane 1'!$C59), \"Relay\")","v":"Evie-May Smith"},{"$f":"IF(OR(R62=\"DQ\",R62=\"DNS\"),\"-\",IF(R62=SMALL((C62,F62,I62,L62,O62,R62),1),1,IF(R62=SMALL((C62,F62,I62,L62,O62,R62),2),2,IF(R62=SMALL((C62,F62,I62,L62,O62,R62),3),3,IF(R62=SMALL((C62,F62,I62,L62,O62,R62),4),4,IF(R62=SMALL((C62,F62,I62,L62,O62,R62),5),5,IF(R62=SMALL((C62,F62,I62,L62,O62,R62),6),6)))))))","v":3},{"$f":"IF(ISTEXT(S61),0,7-S61)","v":4},{"$f":"T61+Q61+N61+K61+H61+E61","v":21}]
[null,"Butterfly","00:00:28.090",null,{"$f":"E60+E61","v":87},"00:00:23.460",null,{"$f":"H60+H61","v":129},"00:00:25.650",null,{"$f":"K60+K61","v":102},"00:00:36.370",null,{"$f":"N60+N61","v":58},"00:00:30.410",null,{"$f":"Q60+Q61","v":98},"00:00:27.130",null,{"$f":"T60+T61","v":105},null,{"$f":"V60+U61","v":579}]
[30,"B 9 yrs 1L",{"$f":"IF(ISERROR(FIND(\"Relay\", $B64)),  IF('Lane 2'!$C61=\"Swimmer\", \"\", 'Lane 2'!$C61), \"Relay\")","v":"Adam Walker"},{"$f":"IF(OR(C64=\"DQ\",C64=\"DNS\"),\"-\",IF(C64=SMALL((C64,F64,I64,L64,O64,R64),1),1,IF(C64=SMALL((C64,F64,I64,L64,O64,R64),2),2,IF(C64=SMALL((C64,F64,I64,L64,O64,R64),3),3,IF(C64=SMALL((C64,F64,I64,L64,O64,R64),4),4,IF(C64=SMALL((C64,F64,I64,L64,O64,R64),5),5,IF(C64=SMALL((C64,F64,I64,L64,O64,R64),6),6)))))))","v":4},{"$f":"IF(ISTEXT(D63),0,7-D63)","v":3},{"$f":"IF(ISERROR(FIND(\"Relay\", $B64)),  IF('Lane 3'!$C61=\"Swimmer\", \"\", 'Lane 3'!$C61), \"Relay\")","v":"Oliver Jennings"},{"$f":"IF(OR(F64=\"DQ\",F64=\"DNS\"),\"-\",IF(F64=SMALL((C64,F64,I64,L64,O64,R64),1),1,IF(F64=SMALL((C64,F64,I64,L64,O64,R64),2),2,IF(F64=SMALL((C64,F64,I64,L64,O64,R64),3),3,IF(F64=SMALL((C64,F64,I64,L64,O64,R64),4),4,IF(F64=SMALL((C64,F64,I64,L64,O64,R64),5),5,IF(F64=SMALL((C64,F64,I64,L64,O64,R64),6),6)))))))","v":3},{"$f":"IF(ISTEXT(G63),0,7-G63)","v":4},{"$f":"IF(ISERROR(FIND(\"Relay\", $B64)),  IF('Lane 4'!$C61=\"Swimmer\", \"\", 'Lane 4'!$C61), \"Relay\")","v":""},{"$f":"IF(OR(I64=\"DQ\",I64=\"DNS\"),\"-\",IF(I64=SMALL((C64,F64,I64,L64,O64,R64),1),1,IF(I64=SMALL((C64,F64,I64,L64,O64,R64),2),2,IF(I64=SMALL((C64,F64,I64,L64,O64,R64),3),3,IF(I64=SMALL((C64,F64,I64,L64,O64,R64),4),4,IF(I64=SMALL((C64,F64,I64,L64,O64,R64),5),5,IF(I64=SMALL((C64,F64,I64,L64,O64,R64),6),6)))))))","v":"-"},{"$f":"IF(ISTEXT(J63),0,7-J63)","v":0},{"$f":"IF(ISERROR(FIND(\"Relay\", $B64)),  IF('Lane 5'!$C61=\"Swimmer\", \"\", 'Lane 5'!$C61), \"Relay\")","v":"James Inshaw"},{"$f":"IF(OR(L64=\"DQ\",L64=\"DNS\"),\"-\",IF(L64=SMALL((C64,F64,I64,L64,O64,R64),1),1,IF(L64=SMALL((C64,F64,I64,L64,O64,R64),2),2,IF(L64=SMALL((C64,F64,I64,L64,O64,R64),3),3,IF(L64=SMALL((C64,F64,I64,L64,O64,R64),4),4,IF(L64=SMALL((C64,F64,I64,L64,O64,R64),5),5,IF(L64=SMALL((C64,F64,I64,L64,O64,R64),6),6)))))))","v":2},{"$f":"IF(ISTEXT(M63),0,7-M63)","v":5},{"$f":"IF(ISERROR(FIND(\"Relay\", $B64)),  IF('Lane 6'!$C61=\"Swimmer\", \"\", 'Lane 6'!$C61), \"Relay\")","v":""},{"$f":"IF(OR(O64=\"DQ\",O64=\"DNS\"),\"-\",IF(O64=SMALL((C64,F64,I64,L64,O64,R64),1),1,IF(O64=SMALL((C64,F64,I64,L64,O64,R64),2),2,IF(O64=SMALL((C64,F64,I64,L64,O64,R64),3),3,IF(O64=SMALL((C64,F64,I64,L64,O64,R64),4),4,IF(O64=SMALL((C64,F64,I64,L64,O64,R64),5),5,IF(O64=SMALL((C64,F64,I64,L64,O64,R64),6),6)))))))","v":"-"},{"$f":"IF(ISTEXT(P63),0,7-P63)","v":0},{"$f":"IF(ISERROR(FIND(\"Relay\", $B64)),  IF('Lane 1'!$C61=\"Swimmer\", \"\", 'Lane 1'!$C61), \"Relay\")","v":"Willem Cunniffe"},{"$f":"IF(OR(R64=\"DQ\",R64=\"DNS\"),\"-\",IF(R64=SMALL((C64,F64,I64,L64,O64,R64),1),1,IF(R64=SMALL((C64,F64,I64,L64,O64,R64),2),2,IF(R64=SMALL((C64,F64,I64,L64,O64,R64),3),3,IF(R64=SMALL((C64,F64,I64,L64,O64,R64),4),4,IF(R64=SMALL((C64,F64,I64,L64,O64,R64),5),5,IF(R64=SMALL((C64,F64,I64,L64,O64,R64),6),6)))))))","v":1},{"$f":"IF(ISTEXT(S63),0,7-S63)","v":6},{"$f":"T63+Q63+N63+K63+H63+E63","v":18}]
[null,"Butterfly","00:00:30.900",null,{"$f":"E62+E63","v":90},"00:00:22.630",null,{"$f":"H62+H63","v":133},"DNS",null,{"$f":"K62+K63","v":102},"00:00:21.250",null,{"$f":"N62+N63","v":63},"DNS",null,{"$f":"Q62+Q63","v":98},"00:00:19.810",null,{"$f":"T62+T63","v":111},null,{"$f":"V62+U63","v":597}]
[31,"G 12/u 2L",{"$f":"IF(ISERROR(FIND(\"Relay\", $B66)),  IF('Lane 2'!$C63=\"Swimmer\", \"\", 'Lane 2'!$C63), \"Relay\")","v":"Libby Wilks"},{"$f":"IF(OR(C66=\"DQ\",C66=\"DNS\"),\"-\",IF(C66=SMALL((C66,F66,I66,L66,O66,R66),1),1,IF(C66=SMALL((C66,F66,I66,L66,O66,R66),2),2,IF(C66=SMALL((C66,F66,I66,L66,O66,R66),3),3,IF(C66=SMALL((C66,F66,I66,L66,O66,R66),4),4,IF(C66=SMALL((C66,F66,I66,L66,O66,R66),5),5,IF(C66=SMALL((C66,F66,I66,L66,O66,R66),6),6)))))))","v":1},{"$f":"IF(ISTEXT(D65),0,7-D65)","v":6},{"$f":"IF(ISERROR(FIND(\"Relay\", $B66)),  IF('Lane 3'!$C63=\"Swimmer\", \"\", 'Lane 3'!$C63), \"Relay\")","v":"Ellie Chater"},{"$f":"IF(OR(F66=\"DQ\",F66=\"DNS\"),\"-\",IF(F66=SMALL((C66,F66,I66,L66,O66,R66),1),1,IF(F66=SMALL((C66,F66,I66,L66,O66,R66),2),2,IF(F66=SMALL((C66,F66,I66,L66,O66,R66),3),3,IF(F66=SMALL((C66,F66,I66,L66,O66,R66),4),4,IF(F66=SMALL((C66,F66,I66,L66,O66,R66),5),5,IF(F66=SMALL((C66,F66,I66,L66,O66,R66),6),6)))))))","v":3},{"$f":"IF(ISTEXT(G65),0,7-G65)","v":4},{"$f":"IF(ISERROR(FIND(\"Relay\", $B66)),  IF('Lane 4'!$C63=\"Swimmer\", \"\", 'Lane 4'!$C63), \"Relay\")","v":"Erin Irving"},{"$f":"IF(OR(I66=\"DQ\",I66=\"DNS\"),\"-\",IF(I66=SMALL((C66,F66,I66,L66,O66,R66),1),1,IF(I66=SMALL((C66,F66,I66,L66,O66,R66),2),2,IF(I66=SMALL((C66,F66,I66,L66,O66,R66),3),3,IF(I66=SMALL((C66,F66,I66,L66,O66,R66),4),4,IF(I66=SMALL((C66,F66,I66,L66,O66,R66),5),5,IF(I66=SMALL((C66,F66,I66,L66,O66,R66),6),6)))))))","v":2},{"$f":"IF(ISTEXT(J65),0,7-J65)","v":5},{"$f":"IF(ISERROR(FIND(\"Relay\", $B66)),  IF('Lane 5'!$C63=\"Swimmer\", \"\", 'Lane 5'!$C63), \"Relay\")","v":"Grace Fatchett"},{"$f":"IF(OR(L66=\"DQ\",L66=\"DNS\"),\"-\",IF(L66=SMALL((C66,F66,I66,L66,O66,R66),1),1,IF(L66=SMALL((C66,F66,I66,L66,O66,R66),2),2,IF(L66=SMALL((C66,F66,I66,L66,O66,R66),3),3,IF(L66=SMALL((C66,F66,I66,L66,O66,R66),4),4,IF(L66=SMALL((C66,F66,I66,L66,O66,R66),5),5,IF(L66=SMALL((C66,F66,I66,L66,O66,R66),6),6)))))))","v":6},{"$f":"IF(ISTEXT(M65),0,7-M65)","v":1},{"$f":"IF(ISERROR(FIND(\"Relay\", $B66)),  IF('Lane 6'!$C63=\"Swimmer\", \"\", 'Lane 6'!$C63), \"Relay\")","v":"E Rollins"},{"$f":"IF(OR(O66=\"DQ\",O66=\"DNS\"),\"-\",IF(O66=SMALL((C66,F66,I66,L66,O66,R66),1),1,IF(O66=SMALL((C66,F66,I66,L66,O66,R66),2),2,IF(O66=SMALL((C66,F66,I66,L66,O66,R66),3),3,IF(O66=SMALL((C66,F66,I66,L66,O66,R66),4),4,IF(O66=SMALL((C66,F66,I66,L66,O66,R66),5),5,IF(O66=SMALL((C66,F66,I66,L66,O66,R66),6),6)))))))","v":4},{"$f":"IF(ISTEXT(P65),0,7-P65)","v":3},{"$f":"IF(ISERROR(FIND(\"Relay\", $B66)),  IF('Lane 1'!$C63=\"Swimmer\", \"\", 'Lane 1'!$C63), \"Relay\")","v":"Sarah Tavares"},{"$f":"IF(OR(R66=\"DQ\",R66=\"DNS\"),\"-\",IF(R66=SMALL((C66,F66,I66,L66,O66,R66),1),1,IF(R66=SMALL((C66,F66,I66,L66,O66,R66),2),2,IF(R66=SMALL((C66,F66,I66,L66,O66,R66),3),3,IF(R66=SMALL((C66,F66,I66,L66,O66,R66),4),4,IF(R66=SMALL((C66,F66,I66,L66,O66,R66),5),5,IF(R66=SMALL((C66,F66,I66,L66,O66,R66),6),6)))))))","v":5},{"$f":"IF(ISTEXT(S65),0,7-S65)","v":2},{"$f":"T65+Q65+N65+K65+H65+E65","v":21}]
[null,"Freestyle","00:00:34.630",null,{"$f":"E64+E65","v":96},"00:00:35.090",null,{"$f":"H64+H65","v":137},"00:00:35.040",null,{"$f":"K64+K65","v":107},"00:00:38.630",null,{"$f":"N64+N65","v":64},"00:00:37.660",null,{"$f":"Q64+Q65","v":101},"00:00:38.530",null,{"$f":"T64+T65","v":113},null,{"$f":"V64+U65","v":618}]
[32,"B 12/u 2L",{"$f":"IF(ISERROR(FIND(\"Relay\", $B68)),  IF('Lane 2'!$C65=\"Swimmer\", \"\", 'Lane 2'!$C65), \"Relay\")","v":"Solomon Mansfield"},{"$f":"IF(OR(C68=\"DQ\",C68=\"DNS\"),\"-\",IF(C68=SMALL((C68,F68,I68,L68,O68,R68),1),1,IF(C68=SMALL((C68,F68,I68,L68,O68,R68),2),2,IF(C68=SMALL((C68,F68,I68,L68,O68,R68),3),3,IF(C68=SMALL((C68,F68,I68,L68,O68,R68),4),4,IF(C68=SMALL((C68,F68,I68,L68,O68,R68),5),5,IF(C68=SMALL((C68,F68,I68,L68,O68,R68),6),6)))))))","v":5},{"$f":"IF(ISTEXT(D67),0,7-D67)","v":2},{"$f":"IF(ISERROR(FIND(\"Relay\", $B68)),  IF('Lane 3'!$C65=\"Swimmer\", \"\", 'Lane 3'!$C65), \"Relay\")","v":"Sam Nicholson"},{"$f":"IF(OR(F68=\"DQ\",F68=\"DNS\"),\"-\",IF(F68=SMALL((C68,F68,I68,L68,O68,R68),1),1,IF(F68=SMALL((C68,F68,I68,L68,O68,R68),2),2,IF(F68=SMALL((C68,F68,I68,L68,O68,R68),3),3,IF(F68=SMALL((C68,F68,I68,L68,O68,R68),4),4,IF(F68=SMALL((C68,F68,I68,L68,O68,R68),5),5,IF(F68=SMALL((C68,F68,I68,L68,O68,R68),6),6)))))))","v":4},{"$f":"IF(ISTEXT(G67),0,7-G67)","v":3},{"$f":"IF(ISERROR(FIND(\"Relay\", $B68)),  IF('Lane 4'!$C65=\"Swimmer\", \"\", 'Lane 4'!$C65), \"Relay\")","v":"Aiden Irving"},{"$f":"IF(OR(I68=\"DQ\",I68=\"DNS\"),\"-\",IF(I68=SMALL((C68,F68,I68,L68,O68,R68),1),1,IF(I68=SMALL((C68,F68,I68,L68,O68,R68),2),2,IF(I68=SMALL((C68,F68,I68,L68,O68,R68),3),3,IF(I68=SMALL((C68,F68,I68,L68,O68,R68),4),4,IF(I68=SMALL((C68,F68,I68,L68,O68,R68),5),5,IF(I68=SMALL((C68,F68,I68,L68,O68,R68),6),6)))))))","v":6},{"$f":"IF(ISTEXT(J67),0,7-J67)","v":1},{"$f":"IF(ISERROR(FIND(\"Relay\", $B68)),  IF('Lane 5'!$C65=\"Swimmer\", \"\", 'Lane 5'!$C65), \"Relay\")","v":"Alfiie Cowie"},{"$f":"IF(OR(L68=\"DQ\",L68=\"DNS\"),\"-\",IF(L68=SMALL((C68,F68,I68,L68,O68,R68),1),1,IF(L68=SMALL((C68,F68,I68,L68,O68,R68),2),2,IF(L68=SMALL((C68,F68,I68,L68,O68,R68),3),3,IF(L68=SMALL((C68,F68,I68,L68,O68,R68),4),4,IF(L68=SMALL((C68,F68,I68,L68,O68,R68),5),5,IF(L68=SMALL((C68,F68,I68,L68,O68,R68),6),6)))))))","v":1},{"$f":"IF(ISTEXT(M67),0,7-M67)","v":6},{"$f":"IF(ISERROR(FIND(\"Relay\", $B68)),  IF('Lane 6'!$C65=\"Swimmer\", \"\", 'Lane 6'!$C65), \"Relay\")","v":"B Webb"},{"$f":"IF(OR(O68=\"DQ\",O68=\"DNS\"),\"-\",IF(O68=SMALL((C68,F68,I68,L68,O68,R68),1),1,IF(O68=SMALL((C68,F68,I68,L68,O68,R68),2),2,IF(O68=SMALL((C68,F68,I68,L68,O68,R68),3),3,IF(O68=SMALL((C68,F68,I68,L68,O68,R68),4),4,IF(O68=SMALL((C68,F68,I68,L68,O68,R68),5),5,IF(O68=SMALL((C68,F68,I68,L68,O68,R68),6),6)))))))","v":2},{"$f":"IF(ISTEXT(P67),0,7-P67)","v":5},{"$f":"IF(ISERROR(FIND(\"Relay\", $B68)),  IF('Lane 1'!$C65=\"Swimmer\", \"\", 'Lane 1'!$C65), \"Relay\")","v":"Luca Whaley"},{"$f":"IF(OR(R68=\"DQ\",R68=\"DNS\"),\"-\",IF(R68=SMALL((C68,F68,I68,L68,O68,R68),1),1,IF(R68=SMALL((C68,F68,I68,L68,O68,R68),2),2,IF(R68=SMALL((C68,F68,I68,L68,O68,R68),3),3,IF(R68=SMALL((C68,F68,I68,L68,O68,R68),4),4,IF(R68=SMALL((C68,F68,I68,L68,O68,R68),5),5,IF(R68=SMALL((C68,F68,I68,L68,O68,R68),6),6)))))))","v":3},{"$f":"IF(ISTEXT(S67),0,7-S67)","v":4},{"$f":"T67+Q67+N67+K67+H67+E67","v":21}]
[null,"Freestyle","00:00:35.430",null,{"$f":"E66+E67","v":98},"00:00:35.080",null,{"$f":"H66+H67","v":140},"00:00:35.440",null,{"$f":"K66+K67","v":108},"00:00:32.500",null,{"$f":"N66+N67","v":70},"00:00:33.290",null,{"$f":"Q66+Q67","v":106},"00:00:34.560",null,{"$f":"T66+T67","v":117},null,{"$f":"V66+U67","v":639}]
[33,"G 8 x 1L ",{"$f":"IF(ISERROR(FIND(\"Relay\", $B70)),  IF('Lane 2'!$C67=\"Swimmer\", \"\", 'Lane 2'!$C67), \"Relay\")","v":"Relay"},{"$f":"IF(OR(C70=\"DQ\",C70=\"DNS\"),\"-\",IF(C70=SMALL((C70,F70,I70,L70,O70,R70),1),1,IF(C70=SMALL((C70,F70,I70,L70,O70,R70),2),2,IF(C70=SMALL((C70,F70,I70,L70,O70,R70),3),3,IF(C70=SMALL((C70,F70,I70,L70,O70,R70),4),4,IF(C70=SMALL((C70,F70,I70,L70,O70,R70),5),5,IF(C70=SMALL((C70,F70,I70,L70,O70,R70),6),6)))))))","v":"-"},{"$f":"IF(ISTEXT(D69),0,7-D69)","v":0},{"$f":"IF(ISERROR(FIND(\"Relay\", $B70)),  IF('Lane 3'!$C67=\"Swimmer\", \"\", 'Lane 3'!$C67), \"Relay\")","v":"Relay"},{"$f":"IF(OR(F70=\"DQ\",F70=\"DNS\"),\"-\",IF(F70=SMALL((C70,F70,I70,L70,O70,R70),1),1,IF(F70=SMALL((C70,F70,I70,L70,O70,R70),2),2,IF(F70=SMALL((C70,F70,I70,L70,O70,R70),3),3,IF(F70=SMALL((C70,F70,I70,L70,O70,R70),4),4,IF(F70=SMALL((C70,F70,I70,L70,O70,R70),5),5,IF(F70=SMALL((C70,F70,I70,L70,O70,R70),6),6)))))))","v":1},{"$f":"IF(ISTEXT(G69),0,7-G69)","v":6},{"$f":"IF(ISERROR(FIND(\"Relay\", $B70)),  IF('Lane 4'!$C67=\"Swimmer\", \"\", 'Lane 4'!$C67), \"Relay\")","v":"Relay"},{"$f":"IF(OR(I70=\"DQ\",I70=\"DNS\"),\"-\",IF(I70=SMALL((C70,F70,I70,L70,O70,R70),1),1,IF(I70=SMALL((C70,F70,I70,L70,O70,R70),2),2,IF(I70=SMALL((C70,F70,I70,L70,O70,R70),3),3,IF(I70=SMALL((C70,F70,I70,L70,O70,R70),4),4,IF(I70=SMALL((C70,F70,I70,L70,O70,R70),5),5,IF(I70=SMALL((C70,F70,I70,L70,O70,R70),6),6)))))))","v":"-"},{"$f":"IF(ISTEXT(J69),0,7-J69)","v":0},{"$f":"IF(ISERROR(FIND(\"Relay\", $B70)),  IF('Lane 5'!$C67=\"Swimmer\", \"\", 'Lane 5'!$C67), \"Relay\")","v":"Relay"},{"$f":"IF(OR(L70=\"DQ\",L70=\"DNS\"),\"-\",IF(L70=SMALL((C70,F70,I70,L70,O70,R70),1),1,IF(L70=SMALL((C70,F70,I70,L70,O70,R70),2),2,IF(L70=SMALL((C70,F70,I70,L70,O70,R70),3),3,IF(L70=SMALL((C70,F70,I70,L70,O70,R70),4),4,IF(L70=SMALL((C70,F70,I70,L70,O70,R70),5),5,IF(L70=SMALL((C70,F70,I70,L70,O70,R70),6),6)))))))","v":4},{"$f":"IF(ISTEXT(M69),0,7-M69)","v":3},{"$f":"IF(ISERROR(FIND(\"Relay\", $B70)),  IF('Lane 6'!$C67=\"Swimmer\", \"\", 'Lane 6'!$C67), \"Relay\")","v":"Relay"},{"$f":"IF(OR(O70=\"DQ\",O70=\"DNS\"),\"-\",IF(O70=SMALL((C70,F70,I70,L70,O70,R70),1),1,IF(O70=SMALL((C70,F70,I70,L70,O70,R70),2),2,IF(O70=SMALL((C70,F70,I70,L70,O70,R70),3),3,IF(O70=SMALL((C70,F70,I70,L70,O70,R70),4),4,IF(O70=SMALL((C70,F70,I70,L70,O70,R70),5),5,IF(O70=SMALL((C70,F70,I70,L70,O70,R70),6),6)))))))","v":3},{"$f":"IF(ISTEXT(P69),0,7-P69)","v":4},{"$f":"IF(ISERROR(FIND(\"Relay\", $B70)),  IF('Lane 1'!$D67=\"Swimmer\", \"\", 'Lane 1'!$D67), \"Relay\")","v":"Relay"},{"$f":"IF(OR(R70=\"DQ\",R70=\"DNS\"),\"-\",IF(R70=SMALL((C70,F70,I70,L70,O70,R70),1),1,IF(R70=SMALL((C70,F70,I70,L70,O70,R70),2),2,IF(R70=SMALL((C70,F70,I70,L70,O70,R70),3),3,IF(R70=SMALL((C70,F70,I70,L70,O70,R70),4),4,IF(R70=SMALL((C70,F70,I70,L70,O70,R70),5),5,IF(R70=SMALL((C70,F70,I70,L70,O70,R70),6),6)))))))","v":2},{"$f":"IF(ISTEXT(S69),0,7-S69)","v":5},{"$f":"T69+Q69+N69+K69+H69+E69","v":18}]
[null,"Freestyle Relay","DQ",null,{"$f":"E68+E69","v":98},"00:02:31.280",null,{"$f":"H68+H69","v":146},"DQ",null,{"$f":"K68+K69","v":108},"00:03:13.070",null,{"$f":"N68+N69","v":73},"00:02:52.530",null,{"$f":"Q68+Q69","v":110},"00:02:37.120",null,{"$f":"T68+T69","v":122},null,{"$f":"V68+U69","v":657}]
[34,"B 10/u 2L",{"$f":"IF(ISERROR(FIND(\"Relay\", $B72)),  IF('Lane 2'!$C69=\"Swimmer\", \"\", 'Lane 2'!$C69), \"Relay\")","v":"Riley Binks"},{"$f":"IF(OR(C72=\"DQ\",C72=\"DNS\"),\"-\",IF(C72=SMALL((C72,F72,I72,L72,O72,R72),1),1,IF(C72=SMALL((C72,F72,I72,L72,O72,R72),2),2,IF(C72=SMALL((C72,F72,I72,L72,O72,R72),3),3,IF(C72=SMALL((C72,F72,I72,L72,O72,R72),4),4,IF(C72=SMALL((C72,F72,I72,L72,O72,R72),5),5,IF(C72=SMALL((C72,F72,I72,L72,O72,R72),6),6)))))))","v":5},{"$f":"IF(ISTEXT(D71),0,7-D71)","v":2},{"$f":"IF(ISERROR(FIND(\"Relay\", $B72)),  IF('Lane 3'!$C69=\"Swimmer\", \"\", 'Lane 3'!$C69), \"Relay\")","v":"Christian Morgan"},{"$f":"IF(OR(F72=\"DQ\",F72=\"DNS\"),\"-\",IF(F72=SMALL((C72,F72,I72,L72,O72,R72),1),1,IF(F72=SMALL((C72,F72,I72,L72,O72,R72),2),2,IF(F72=SMALL((C72,F72,I72,L72,O72,R72),3),3,IF(F72=SMALL((C72,F72,I72,L72,O72,R72),4),4,IF(F72=SMALL((C72,F72,I72,L72,O72,R72),5),5,IF(F72=SMALL((C72,F72,I72,L72,O72,R72),6),6)))))))","v":3},{"$f":"IF(ISTEXT(G71),0,7-G71)","v":4},{"$f":"IF(ISERROR(FIND(\"Relay\", $B72)),  IF('Lane 4'!$C69=\"Swimmer\", \"\", 'Lane 4'!$C69), \"Relay\")","v":"Luke Burton"},{"$f":"IF(OR(I72=\"DQ\",I72=\"DNS\"),\"-\",IF(I72=SMALL((C72,F72,I72,L72,O72,R72),1),1,IF(I72=SMALL((C72,F72,I72,L72,O72,R72),2),2,IF(I72=SMALL((C72,F72,I72,L72,O72,R72),3),3,IF(I72=SMALL((C72,F72,I72,L72,O72,R72),4),4,IF(I72=SMALL((C72,F72,I72,L72,O72,R72),5),5,IF(I72=SMALL((C72,F72,I72,L72,O72,R72),6),6)))))))","v":1},{"$f":"IF(ISTEXT(J71),0,7-J71)","v":6},{"$f":"IF(ISERROR(FIND(\"Relay\", $B72)),  IF('Lane 5'!$C69=\"Swimmer\", \"\", 'Lane 5'!$C69), \"Relay\")","v":"Veer Mulji"},{"$f":"IF(OR(L72=\"DQ\",L72=\"DNS\"),\"-\",IF(L72=SMALL((C72,F72,I72,L72,O72,R72),1),1,IF(L72=SMALL((C72,F72,I72,L72,O72,R72),2),2,IF(L72=SMALL((C72,F72,I72,L72,O72,R72),3),3,IF(L72=SMALL((C72,F72,I72,L72,O72,R72),4),4,IF(L72=SMALL((C72,F72,I72,L72,O72,R72),5),5,IF(L72=SMALL((C72,F72,I72,L72,O72,R72),6),6)))))))","v":"-"},{"$f":"IF(ISTEXT(M71),0,7-M71)","v":0},{"$f":"IF(ISERROR(FIND(\"Relay\", $B72)),  IF('Lane 6'!$C69=\"Swimmer\", \"\", 'Lane 6'!$C69), \"Relay\")","v":"T Mobbs"},{"$f":"IF(OR(O72=\"DQ\",O72=\"DNS\"),\"-\",IF(O72=SMALL((C72,F72,I72,L72,O72,R72),1),1,IF(O72=SMALL((C72,F72,I72,L72,O72,R72),2),2,IF(O72=SMALL((C72,F72,I72,L72,O72,R72),3),3,IF(O72=SMALL((C72,F72,I72,L72,O72,R72),4),4,IF(O72=SMALL((C72,F72,I72,L72,O72,R72),5),5,IF(O72=SMALL((C72,F72,I72,L72,O72,R72),6),6)))))))","v":2},{"$f":"IF(ISTEXT(P71),0,7-P71)","v":5},{"$f":"IF(ISERROR(FIND(\"Relay\", $B72)),  IF('Lane 1'!$C69=\"Swimmer\", \"\", 'Lane 1'!$C69), \"Relay\")","v":"Musa Yusopov"},{"$f":"IF(OR(R72=\"DQ\",R72=\"DNS\"),\"-\",IF(R72=SMALL((C72,F72,I72,L72,O72,R72),1),1,IF(R72=SMALL((C72,F72,I72,L72,O72,R72),2),2,IF(R72=SMALL((C72,F72,I72,L72,O72,R72),3),3,IF(R72=SMALL((C72,F72,I72,L72,O72,R72),4),4,IF(R72=SMALL((C72,F72,I72,L72,O72,R72),5),5,IF(R72=SMALL((C72,F72,I72,L72,O72,R72),6),6)))))))","v":4},{"$f":"IF(ISTEXT(S71),0,7-S71)","v":3},{"$f":"T71+Q71+N71+K71+H71+E71","v":20}]
[null,"Backstroke","00:00:54.510",null,{"$f":"E70+E71","v":100},"00:00:46.960",null,{"$f":"H70+H71","v":150},"00:00:45.630",null,{"$f":"K70+K71","v":114},"DQ",null,{"$f":"N70+N71","v":73},"00:00:45.640",null,{"$f":"Q70+Q71","v":115},"00:00:53.060",null,{"$f":"T70+T71","v":125},null,{"$f":"V70+U71","v":677}]
[35,"G 10/u 2L",{"$f":"IF(ISERROR(FIND(\"Relay\", $B74)),  IF('Lane 2'!$C71=\"Swimmer\", \"\", 'Lane 2'!$C71), \"Relay\")","v":"Amber Valletta"},{"$f":"IF(OR(C74=\"DQ\",C74=\"DNS\"),\"-\",IF(C74=SMALL((C74,F74,I74,L74,O74,R74),1),1,IF(C74=SMALL((C74,F74,I74,L74,O74,R74),2),2,IF(C74=SMALL((C74,F74,I74,L74,O74,R74),3),3,IF(C74=SMALL((C74,F74,I74,L74,O74,R74),4),4,IF(C74=SMALL((C74,F74,I74,L74,O74,R74),5),5,IF(C74=SMALL((C74,F74,I74,L74,O74,R74),6),6)))))))","v":2},{"$f":"IF(ISTEXT(D73),0,7-D73)","v":5},{"$f":"IF(ISERROR(FIND(\"Relay\", $B74)),  IF('Lane 3'!$C71=\"Swimmer\", \"\", 'Lane 3'!$C71), \"Relay\")","v":"Elloiuse Brookes"},{"$f":"IF(OR(F74=\"DQ\",F74=\"DNS\"),\"-\",IF(F74=SMALL((C74,F74,I74,L74,O74,R74),1),1,IF(F74=SMALL((C74,F74,I74,L74,O74,R74),2),2,IF(F74=SMALL((C74,F74,I74,L74,O74,R74),3),3,IF(F74=SMALL((C74,F74,I74,L74,O74,R74),4),4,IF(F74=SMALL((C74,F74,I74,L74,O74,R74),5),5,IF(F74=SMALL((C74,F74,I74,L74,O74,R74),6),6)))))))","v":1},{"$f":"IF(ISTEXT(G73),0,7-G73)","v":6},{"$f":"IF(ISERROR(FIND(\"Relay\", $B74)),  IF('Lane 4'!$C71=\"Swimmer\", \"\", 'Lane 4'!$C71), \"Relay\")","v":"Louise Khrone"},{"$f":"IF(OR(I74=\"DQ\",I74=\"DNS\"),\"-\",IF(I74=SMALL((C74,F74,I74,L74,O74,R74),1),1,IF(I74=SMALL((C74,F74,I74,L74,O74,R74),2),2,IF(I74=SMALL((C74,F74,I74,L74,O74,R74),3),3,IF(I74=SMALL((C74,F74,I74,L74,O74,R74),4),4,IF(I74=SMALL((C74,F74,I74,L74,O74,R74),5),5,IF(I74=SMALL((C74,F74,I74,L74,O74,R74),6),6)))))))","v":3},{"$f":"IF(ISTEXT(J73),0,7-J73)","v":4},{"$f":"IF(ISERROR(FIND(\"Relay\", $B74)),  IF('Lane 5'!$C71=\"Swimmer\", \"\", 'Lane 5'!$C71), \"Relay\")","v":"Neveah Choudhury"},{"$f":"IF(OR(L74=\"DQ\",L74=\"DNS\"),\"-\",IF(L74=SMALL((C74,F74,I74,L74,O74,R74),1),1,IF(L74=SMALL((C74,F74,I74,L74,O74,R74),2),2,IF(L74=SMALL((C74,F74,I74,L74,O74,R74),3),3,IF(L74=SMALL((C74,F74,I74,L74,O74,R74),4),4,IF(L74=SMALL((C74,F74,I74,L74,O74,R74),5),5,IF(L74=SMALL((C74,F74,I74,L74,O74,R74),6),6)))))))","v":5},{"$f":"IF(ISTEXT(M73),0,7-M73)","v":2},{"$f":"IF(ISERROR(FIND(\"Relay\", $B74)),  IF('Lane 6'!$C71=\"Swimmer\", \"\", 'Lane 6'!$C71), \"Relay\")","v":"S Warrilow"},{"$f":"IF(OR(O74=\"DQ\",O74=\"DNS\"),\"-\",IF(O74=SMALL((C74,F74,I74,L74,O74,R74),1),1,IF(O74=SMALL((C74,F74,I74,L74,O74,R74),2),2,IF(O74=SMALL((C74,F74,I74,L74,O74,R74),3),3,IF(O74=SMALL((C74,F74,I74,L74,O74,R74),4),4,IF(O74=SMALL((C74,F74,I74,L74,O74,R74),5),5,IF(O74=SMALL((C74,F74,I74,L74,O74,R74),6),6)))))))","v":4},{"$f":"IF(ISTEXT(P73),0,7-P73)","v":3},{"$f":"IF(ISERROR(FIND(\"Relay\", $B74)),  IF('Lane 1'!$C71=\"Swimmer\", \"\", 'Lane 1'!$C71), \"Relay\")","v":"Lacey Small"},{"$f":"IF(OR(R74=\"DQ\",R74=\"DNS\"),\"-\",IF(R74=SMALL((C74,F74,I74,L74,O74,R74),1),1,IF(R74=SMALL((C74,F74,I74,L74,O74,R74),2),2,IF(R74=SMALL((C74,F74,I74,L74,O74,R74),3),3,IF(R74=SMALL((C74,F74,I74,L74,O74,R74),4),4,IF(R74=SMALL((C74,F74,I74,L74,O74,R74),5),5,IF(R74=SMALL((C74,F74,I74,L74,O74,R74),6),6)))))))","v":"-"},{"$f":"IF(ISTEXT(S73),0,7-S73)","v":0},{"$f":"T73+Q73+N73+K73+H73+E73","v":20}]
[null,"Backstroke","00:00:46.630",null,{"$f":"E72+E73","v":105},"00:00:44.980",null,{"$f":"H72+H73","v":156},"00:00:47.480",null,{"$f":"K72+K73","v":118},"00:01:03.020",null,{"$f":"N72+N73","v":75},"00:01:00.500",null,{"$f":"Q72+Q73","v":118},"DQ",null,{"$f":"T72+T73","v":125},null,{"$f":"V72+U73","v":697}]
[36,"B 9 yrs 1L",{"$f":"IF(ISERROR(FIND(\"Relay\", $B76)),  IF('Lane 2'!$C73=\"Swimmer\", \"\", 'Lane 2'!$C73), \"Relay\")","v":"Adam Walker"},{"$f":"IF(OR(C76=\"DQ\",C76=\"DNS\"),\"-\",IF(C76=SMALL((C76,F76,I76,L76,O76,R76),1),1,IF(C76=SMALL((C76,F76,I76,L76,O76,R76),2),2,IF(C76=SMALL((C76,F76,I76,L76,O76,R76),3),3,IF(C76=SMALL((C76,F76,I76,L76,O76,R76),4),4,IF(C76=SMALL((C76,F76,I76,L76,O76,R76),5),5,IF(C76=SMALL((C76,F76,I76,L76,O76,R76),6),6)))))))","v":3},{"$f":"IF(ISTEXT(D75),0,7-D75)","v":4},{"$f":"IF(ISERROR(FIND(\"Relay\", $B76)),  IF('Lane 3'!$C73=\"Swimmer\", \"\", 'Lane 3'!$C73), \"Relay\")","v":"Oliver Jennings"},{"$f":"IF(OR(F76=\"DQ\",F76=\"DNS\"),\"-\",IF(F76=SMALL((C76,F76,I76,L76,O76,R76),1),1,IF(F76=SMALL((C76,F76,I76,L76,O76,R76),2),2,IF(F76=SMALL((C76,F76,I76,L76,O76,R76),3),3,IF(F76=SMALL((C76,F76,I76,L76,O76,R76),4),4,IF(F76=SMALL((C76,F76,I76,L76,O76,R76),5),5,IF(F76=SMALL((C76,F76,I76,L76,O76,R76),6),6)))))))","v":1},{"$f":"IF(ISTEXT(G75),0,7-G75)","v":6},{"$f":"IF(ISERROR(FIND(\"Relay\", $B76)),  IF('Lane 4'!$C73=\"Swimmer\", \"\", 'Lane 4'!$C73), \"Relay\")","v":"Ethan Ryan"},{"$f":"IF(OR(I76=\"DQ\",I76=\"DNS\"),\"-\",IF(I76=SMALL((C76,F76,I76,L76,O76,R76),1),1,IF(I76=SMALL((C76,F76,I76,L76,O76,R76),2),2,IF(I76=SMALL((C76,F76,I76,L76,O76,R76),3),3,IF(I76=SMALL((C76,F76,I76,L76,O76,R76),4),4,IF(I76=SMALL((C76,F76,I76,L76,O76,R76),5),5,IF(I76=SMALL((C76,F76,I76,L76,O76,R76),6),6)))))))","v":5},{"$f":"IF(ISTEXT(J75),0,7-J75)","v":2},{"$f":"IF(ISERROR(FIND(\"Relay\", $B76)),  IF('Lane 5'!$C73=\"Swimmer\", \"\", 'Lane 5'!$C73), \"Relay\")","v":"00:00:00"},{"$f":"IF(OR(L76=\"DQ\",L76=\"DNS\"),\"-\",IF(L76=SMALL((C76,F76,I76,L76,O76,R76),1),1,IF(L76=SMALL((C76,F76,I76,L76,O76,R76),2),2,IF(L76=SMALL((C76,F76,I76,L76,O76,R76),3),3,IF(L76=SMALL((C76,F76,I76,L76,O76,R76),4),4,IF(L76=SMALL((C76,F76,I76,L76,O76,R76),5),5,IF(L76=SMALL((C76,F76,I76,L76,O76,R76),6),6)))))))","v":"-"},{"$f":"IF(ISTEXT(M75),0,7-M75)","v":0},{"$f":"IF(ISERROR(FIND(\"Relay\", $B76)),  IF('Lane 6'!$C73=\"Swimmer\", \"\", 'Lane 6'!$C73), \"Relay\")","v":"J Watson"},{"$f":"IF(OR(O76=\"DQ\",O76=\"DNS\"),\"-\",IF(O76=SMALL((C76,F76,I76,L76,O76,R76),1),1,IF(O76=SMALL((C76,F76,I76,L76,O76,R76),2),2,IF(O76=SMALL((C76,F76,I76,L76,O76,R76),3),3,IF(O76=SMALL((C76,F76,I76,L76,O76,R76),4),4,IF(O76=SMALL((C76,F76,I76,L76,O76,R76),5),5,IF(O76=SMALL((C76,F76,I76,L76,O76,R76),6),6)))))))","v":4},{"$f":"IF(ISTEXT(P75),0,7-P75)","v":3},{"$f":"IF(ISERROR(FIND(\"Relay\", $B76)),  IF('Lane 1'!$C73=\"Swimmer\", \"\", 'Lane 1'!$C73), \"Relay\")","v":"Willem Cunniffe"},{"$f":"IF(OR(R76=\"DQ\",R76=\"DNS\"),\"-\",IF(R76=SMALL((C76,F76,I76,L76,O76,R76),1),1,IF(R76=SMALL((C76,F76,I76,L76,O76,R76),2),2,IF(R76=SMALL((C76,F76,I76,L76,O76,R76),3),3,IF(R76=SMALL((C76,F76,I76,L76,O76,R76),4),4,IF(R76=SMALL((C76,F76,I76,L76,O76,R76),5),5,IF(R76=SMALL((C76,F76,I76,L76,O76,R76),6),6)))))))","v":2},{"$f":"IF(ISTEXT(S75),0,7-S75)","v":5},{"$f":"T75+Q75+N75+K75+H75+E75","v":20}]
[null,"Freestyle","00:00:20.410",null,{"$f":"E74+E75","v":109},"00:00:17.320",null,{"$f":"H74+H75","v":162},"00:00:32.460",null,{"$f":"K74+K75","v":120},"DNS",null,{"$f":"N74+N75","v":75},"00:00:22.030",null,{"$f":"Q74+Q75","v":121},"00:00:18.370",null,{"$f":"T74+T75","v":130},null,{"$f":"V74+U75","v":717}]
[37,"G 9 yrs 1L",{"$f":"IF(ISERROR(FIND(\"Relay\", $B78)),  IF('Lane 2'!$C75=\"Swimmer\", \"\", 'Lane 2'!$C75), \"Relay\")","v":"Tiffany Latham"},{"$f":"IF(OR(C78=\"DQ\",C78=\"DNS\"),\"-\",IF(C78=SMALL((C78,F78,I78,L78,O78,R78),1),1,IF(C78=SMALL((C78,F78,I78,L78,O78,R78),2),2,IF(C78=SMALL((C78,F78,I78,L78,O78,R78),3),3,IF(C78=SMALL((C78,F78,I78,L78,O78,R78),4),4,IF(C78=SMALL((C78,F78,I78,L78,O78,R78),5),5,IF(C78=SMALL((C78,F78,I78,L78,O78,R78),6),6)))))))","v":5},{"$f":"IF(ISTEXT(D77),0,7-D77)","v":2},{"$f":"IF(ISERROR(FIND(\"Relay\", $B78)),  IF('Lane 3'!$C75=\"Swimmer\", \"\", 'Lane 3'!$C75), \"Relay\")","v":"Harriet Granahan"},{"$f":"IF(OR(F78=\"DQ\",F78=\"DNS\"),\"-\",IF(F78=SMALL((C78,F78,I78,L78,O78,R78),1),1,IF(F78=SMALL((C78,F78,I78,L78,O78,R78),2),2,IF(F78=SMALL((C78,F78,I78,L78,O78,R78),3),3,IF(F78=SMALL((C78,F78,I78,L78,O78,R78),4),4,IF(F78=SMALL((C78,F78,I78,L78,O78,R78),5),5,IF(F78=SMALL((C78,F78,I78,L78,O78,R78),6),6)))))))","v":2},{"$f":"IF(ISTEXT(G77),0,7-G77)","v":5},{"$f":"IF(ISERROR(FIND(\"Relay\", $B78)),  IF('Lane 4'!$C75=\"Swimmer\", \"\", 'Lane 4'!$C75), \"Relay\")","v":"Cassie Kelly-Cooper"},{"$f":"IF(OR(I78=\"DQ\",I78=\"DNS\"),\"-\",IF(I78=SMALL((C78,F78,I78,L78,O78,R78),1),1,IF(I78=SMALL((C78,F78,I78,L78,O78,R78),2),2,IF(I78=SMALL((C78,F78,I78,L78,O78,R78),3),3,IF(I78=SMALL((C78,F78,I78,L78,O78,R78),4),4,IF(I78=SMALL((C78,F78,I78,L78,O78,R78),5),5,IF(I78=SMALL((C78,F78,I78,L78,O78,R78),6),6)))))))","v":1},{"$f":"IF(ISTEXT(J77),0,7-J77)","v":6},{"$f":"IF(ISERROR(FIND(\"Relay\", $B78)),  IF('Lane 5'!$C75=\"Swimmer\", \"\", 'Lane 5'!$C75), \"Relay\")","v":"Lucy Talbot-Fielding"},{"$f":"IF(OR(L78=\"DQ\",L78=\"DNS\"),\"-\",IF(L78=SMALL((C78,F78,I78,L78,O78,R78),1),1,IF(L78=SMALL((C78,F78,I78,L78,O78,R78),2),2,IF(L78=SMALL((C78,F78,I78,L78,O78,R78),3),3,IF(L78=SMALL((C78,F78,I78,L78,O78,R78),4),4,IF(L78=SMALL((C78,F78,I78,L78,O78,R78),5),5,IF(L78=SMALL((C78,F78,I78,L78,O78,R78),6),6)))))))","v":6},{"$f":"IF(ISTEXT(M77),0,7-M77)","v":1},{"$f":"IF(ISERROR(FIND(\"Relay\", $B78)),  IF('Lane 6'!$C75=\"Swimmer\", \"\", 'Lane 6'!$C75), \"Relay\")","v":"M Munslow"},{"$f":"IF(OR(O78=\"DQ\",O78=\"DNS\"),\"-\",IF(O78=SMALL((C78,F78,I78,L78,O78,R78),1),1,IF(O78=SMALL((C78,F78,I78,L78,O78,R78),2),2,IF(O78=SMALL((C78,F78,I78,L78,O78,R78),3),3,IF(O78=SMALL((C78,F78,I78,L78,O78,R78),4),4,IF(O78=SMALL((C78,F78,I78,L78,O78,R78),5),5,IF(O78=SMALL((C78,F78,I78,L78,O78,R78),6),6)))))))","v":4},{"$f":"IF(ISTEXT(P77),0,7-P77)","v":3},{"$f":"IF(ISERROR(FIND(\"Relay\", $B78)),  IF('Lane 1'!$C75=\"Swimmer\", \"\", 'Lane 1'!$C75), \"Relay\")","v":"Abigail Bowater"},{"$f":"IF(OR(R78=\"DQ\",R78=\"DNS\"),\"-\",IF(R78=SMALL((C78,F78,I78,L78,O78,R78),1),1,IF(R78=SMALL((C78,F78,I78,L78,O78,R78),2),2,IF(R78=SMALL((C78,F78,I78,L78,O78,R78),3),3,IF(R78=SMALL((C78,F78,I78,L78,O78,R78),4),4,IF(R78=SMALL((C78,F78,I78,L78,O78,R78),5),5,IF(R78=SMALL((C78,F78,I78,L78,O78,R78),6),6)))))))","v":3},{"$f":"IF(ISTEXT(S77),0,7-S77)","v":4},{"$f":"T77+Q77+N77+K77+H77+E77","v":21}]
[null,"Freestyle","00:00:21.940",null,{"$f":"E76+E77","v":111},"00:00:20.090",null,{"$f":"H76+H77","v":167},"00:00:19.650",null,{"$f":"K76+K77","v":126},"00:00:26.190",null,{"$f":"N76+N77","v":76},"00:00:21.930",null,{"$f":"Q76+Q77","v":124},"00:00:21.440",null,{"$f":"T76+T77","v":134},null,{"$f":"V76+U77","v":738}]
[38,"B 12/u 4 x 1L",{"$f":"IF(ISERROR(FIND(\"Relay\", $B80)),  IF('Lane 2'!$C77=\"Swimmer\", \"\", 'Lane 2'!$C77), \"Relay\")","v":"Relay"},{"$f":"IF(OR(C80=\"DQ\",C80=\"DNS\"),\"-\",IF(C80=SMALL((C80,F80,I80,L80,O80,R80),1),1,IF(C80=SMALL((C80,F80,I80,L80,O80,R80),2),2,IF(C80=SMALL((C80,F80,I80,L80,O80,R80),3),3,IF(C80=SMALL((C80,F80,I80,L80,O80,R80),4),4,IF(C80=SMALL((C80,F80,I80,L80,O80,R80),5),5,IF(C80=SMALL((C80,F80,I80,L80,O80,R80),6),6)))))))","v":6},{"$f":"IF(ISTEXT(D79),0,7-D79)","v":1},{"$f":"IF(ISERROR(FIND(\"Relay\", $B80)),  IF('Lane 3'!$C77=\"Swimmer\", \"\", 'Lane 3'!$C77), \"Relay\")","v":"Relay"},{"$f":"IF(OR(F80=\"DQ\",F80=\"DNS\"),\"-\",IF(F80=SMALL((C80,F80,I80,L80,O80,R80),1),1,IF(F80=SMALL((C80,F80,I80,L80,O80,R80),2),2,IF(F80=SMALL((C80,F80,I80,L80,O80,R80),3),3,IF(F80=SMALL((C80,F80,I80,L80,O80,R80),4),4,IF(F80=SMALL((C80,F80,I80,L80,O80,R80),5),5,IF(F80=SMALL((C80,F80,I80,L80,O80,R80),6),6)))))))","v":2},{"$f":"IF(ISTEXT(G79),0,7-G79)","v":5},{"$f":"IF(ISERROR(FIND(\"Relay\", $B80)),  IF('Lane 4'!$C77=\"Swimmer\", \"\", 'Lane 4'!$C77), \"Relay\")","v":"Relay"},{"$f":"IF(OR(I80=\"DQ\",I80=\"DNS\"),\"-\",IF(I80=SMALL((C80,F80,I80,L80,O80,R80),1),1,IF(I80=SMALL((C80,F80,I80,L80,O80,R80),2),2,IF(I80=SMALL((C80,F80,I80,L80,O80,R80),3),3,IF(I80=SMALL((C80,F80,I80,L80,O80,R80),4),4,IF(I80=SMALL((C80,F80,I80,L80,O80,R80),5),5,IF(I80=SMALL((C80,F80,I80,L80,O80,R80),6),6)))))))","v":1},{"$f":"IF(ISTEXT(J79),0,7-J79)","v":6},{"$f":"IF(ISERROR(FIND(\"Relay\", $B80)),  IF('Lane 5'!$C77=\"Swimmer\", \"\", 'Lane 5'!$C77), \"Relay\")","v":"Relay"},{"$f":"IF(OR(L80=\"DQ\",L80=\"DNS\"),\"-\",IF(L80=SMALL((C80,F80,I80,L80,O80,R80),1),1,IF(L80=SMALL((C80,F80,I80,L80,O80,R80),2),2,IF(L80=SMALL((C80,F80,I80,L80,O80,R80),3),3,IF(L80=SMALL((C80,F80,I80,L80,O80,R80),4),4,IF(L80=SMALL((C80,F80,I80,L80,O80,R80),5),5,IF(L80=SMALL((C80,F80,I80,L80,O80,R80),6),6)))))))","v":3},{"$f":"IF(ISTEXT(M79),0,7-M79)","v":4},{"$f":"IF(ISERROR(FIND(\"Relay\", $B80)),  IF('Lane 6'!$C77=\"Swimmer\", \"\", 'Lane 6'!$C77), \"Relay\")","v":"Relay"},{"$f":"IF(OR(O80=\"DQ\",O80=\"DNS\"),\"-\",IF(O80=SMALL((C80,F80,I80,L80,O80,R80),1),1,IF(O80=SMALL((C80,F80,I80,L80,O80,R80),2),2,IF(O80=SMALL((C80,F80,I80,L80,O80,R80),3),3,IF(O80=SMALL((C80,F80,I80,L80,O80,R80),4),4,IF(O80=SMALL((C80,F80,I80,L80,O80,R80),5),5,IF(O80=SMALL((C80,F80,I80,L80,O80,R80),6),6)))))))","v":4},{"$f":"IF(ISTEXT(P79),0,7-P79)","v":3},{"$f":"IF(ISERROR(FIND(\"Relay\", $B80)),  IF('Lane 1'!$D77=\"Swimmer\", \"\", 'Lane 1'!$D77), \"Relay\")","v":"Relay"},{"$f":"IF(OR(R80=\"DQ\",R80=\"DNS\"),\"-\",IF(R80=SMALL((C80,F80,I80,L80,O80,R80),1),1,IF(R80=SMALL((C80,F80,I80,L80,O80,R80),2),2,IF(R80=SMALL((C80,F80,I80,L80,O80,R80),3),3,IF(R80=SMALL((C80,F80,I80,L80,O80,R80),4),4,IF(R80=SMALL((C80,F80,I80,L80,O80,R80),5),5,IF(R80=SMALL((C80,F80,I80,L80,O80,R80),6),6)))))))","v":5},{"$f":"IF(ISTEXT(S79),0,7-S79)","v":2},{"$f":"T79+Q79+N79+K79+H79+E79","v":21}]
[null,"Freestyle Relay","00:01:15.520",null,{"$f":"E78+E79","v":112},"00:01:05.530",null,{"$f":"H78+H79","v":172},"00:01:04.810",null,{"$f":"K78+K79","v":132},"00:01:08.440",null,{"$f":"N78+N79","v":80},"00:01:09.780",null,{"$f":"Q78+Q79","v":127},"00:01:14.720",null,{"$f":"T78+T79","v":136},null,{"$f":"V78+U79","v":759}]
[39,"G 12/u 4 x 1L",{"$f":"IF(ISERROR(FIND(\"Relay\", $B82)),  IF('Lane 2'!$C79=\"Swimmer\", \"\", 'Lane 2'!$C79), \"Relay\")","v":"Relay"},{"$f":"IF(OR(C82=\"DQ\",C82=\"DNS\"),\"-\",IF(C82=SMALL((C82,F82,I82,L82,O82,R82),1),1,IF(C82=SMALL((C82,F82,I82,L82,O82,R82),2),2,IF(C82=SMALL((C82,F82,I82,L82,O82,R82),3),3,IF(C82=SMALL((C82,F82,I82,L82,O82,R82),4),4,IF(C82=SMALL((C82,F82,I82,L82,O82,R82),5),5,IF(C82=SMALL((C82,F82,I82,L82,O82,R82),6),6)))))))","v":"-"},{"$f":"IF(ISTEXT(D81),0,7-D81)","v":0},{"$f":"IF(ISERROR(FIND(\"Relay\", $B82)),  IF('Lane 3'!$C79=\"Swimmer\", \"\", 'Lane 3'!$C79), \"Relay\")","v":"Relay"},{"$f":"IF(OR(F82=\"DQ\",F82=\"DNS\"),\"-\",IF(F82=SMALL((C82,F82,I82,L82,O82,R82),1),1,IF(F82=SMALL((C82,F82,I82,L82,O82,R82),2),2,IF(F82=SMALL((C82,F82,I82,L82,O82,R82),3),3,IF(F82=SMALL((C82,F82,I82,L82,O82,R82),4),4,IF(F82=SMALL((C82,F82,I82,L82,O82,R82),5),5,IF(F82=SMALL((C82,F82,I82,L82,O82,R82),6),6)))))))","v":3},{"$f":"IF(ISTEXT(G81),0,7-G81)","v":4},{"$f":"IF(ISERROR(FIND(\"Relay\", $B82)),  IF('Lane 4'!$C79=\"Swimmer\", \"\", 'Lane 4'!$C79), \"Relay\")","v":"Relay"},{"$f":"IF(OR(I82=\"DQ\",I82=\"DNS\"),\"-\",IF(I82=SMALL((C82,F82,I82,L82,O82,R82),1),1,IF(I82=SMALL((C82,F82,I82,L82,O82,R82),2),2,IF(I82=SMALL((C82,F82,I82,L82,O82,R82),3),3,IF(I82=SMALL((C82,F82,I82,L82,O82,R82),4),4,IF(I82=SMALL((C82,F82,I82,L82,O82,R82),5),5,IF(I82=SMALL((C82,F82,I82,L82,O82,R82),6),6)))))))","v":2},{"$f":"IF(ISTEXT(J81),0,7-J81)","v":5},{"$f":"IF(ISERROR(FIND(\"Relay\", $B82)),  IF('Lane 5'!$C79=\"Swimmer\", \"\", 'Lane 5'!$C79), \"Relay\")","v":"Relay"},{"$f":"IF(OR(L82=\"DQ\",L82=\"DNS\"),\"-\",IF(L82=SMALL((C82,F82,I82,L82,O82,R82),1),1,IF(L82=SMALL((C82,F82,I82,L82,O82,R82),2),2,IF(L82=SMALL((C82,F82,I82,L82,O82,R82),3),3,IF(L82=SMALL((C82,F82,I82,L82,O82,R82),4),4,IF(L82=SMALL((C82,F82,I82,L82,O82,R82),5),5,IF(L82=SMALL((C82,F82,I82,L82,O82,R82),6),6)))))))","v":1},{"$f":"IF(ISTEXT(M81),0,7-M81)","v":6},{"$f":"IF(ISERROR(FIND(\"Relay\", $B82)),  IF('Lane 6'!$C79=\"Swimmer\", \"\", 'Lane 6'!$C79), \"Relay\")","v":"Relay"},{"$f":"IF(OR(O82=\"DQ\",O82=\"DNS\"),\"-\",IF(O82=SMALL((C82,F82,I82,L82,O82,R82),1),1,IF(O82=SMALL((C82,F82,I82,L82,O82,R82),2),2,IF(O82=SMALL((C82,F82,I82,L82,O82,R82),3),3,IF(O82=SMALL((C82,F82,I82,L82,O82,R82),4),4,IF(O82=SMALL((C82,F82,I82,L82,O82,R82),5),5,IF(O82=SMALL((C82,F82,I82,L82,O82,R82),6),6)))))))","v":5},{"$f":"IF(ISTEXT(P81),0,7-P81)","v":2},{"$f":"IF(ISERROR(FIND(\"Relay\", $B82)),  IF('Lane 1'!$D79=\"Swimmer\", \"\", 'Lane 1'!$D79), \"Relay\")","v":"Relay"},{"$f":"IF(OR(R82=\"DQ\",R82=\"DNS\"),\"-\",IF(R82=SMALL((C82,F82,I82,L82,O82,R82),1),1,IF(R82=SMALL((C82,F82,I82,L82,O82,R82),2),2,IF(R82=SMALL((C82,F82,I82,L82,O82,R82),3),3,IF(R82=SMALL((C82,F82,I82,L82,O82,R82),4),4,IF(R82=SMALL((C82,F82,I82,L82,O82,R82),5),5,IF(R82=SMALL((C82,F82,I82,L82,O82,R82),6),6)))))))","v":4},{"$f":"IF(ISTEXT(S81),0,7-S81)","v":3},{"$f":"T81+Q81+N81+K81+H81+E81","v":20}]
[null,"Freestyle Relay","DQ",null,{"$f":"E80+E81","v":112},"00:01:10.270",null,{"$f":"H80+H81","v":176},"00:01:08.960",null,{"$f":"K80+K81","v":137},"00:01:04.440",null,{"$f":"N80+N81","v":86},"00:01:13.940",null,{"$f":"Q80+Q81","v":129},"00:01:11.860",null,{"$f":"T80+T81","v":139},null,{"$f":"V80+U81","v":779}]
[40,"B 11/u 2L",{"$f":"IF(ISERROR(FIND(\"Relay\", $B84)),  IF('Lane 2'!$C81=\"Swimmer\", \"\", 'Lane 2'!$C81), \"Relay\")","v":"Lachlin Woodend"},{"$f":"IF(OR(C84=\"DQ\",C84=\"DNS\"),\"-\",IF(C84=SMALL((C84,F84,I84,L84,O84,R84),1),1,IF(C84=SMALL((C84,F84,I84,L84,O84,R84),2),2,IF(C84=SMALL((C84,F84,I84,L84,O84,R84),3),3,IF(C84=SMALL((C84,F84,I84,L84,O84,R84),4),4,IF(C84=SMALL((C84,F84,I84,L84,O84,R84),5),5,IF(C84=SMALL((C84,F84,I84,L84,O84,R84),6),6)))))))","v":3},{"$f":"IF(ISTEXT(D83),0,7-D83)","v":4},{"$f":"IF(ISERROR(FIND(\"Relay\", $B84)),  IF('Lane 3'!$C81=\"Swimmer\", \"\", 'Lane 3'!$C81), \"Relay\")","v":"Sam Withey"},{"$f":"IF(OR(F84=\"DQ\",F84=\"DNS\"),\"-\",IF(F84=SMALL((C84,F84,I84,L84,O84,R84),1),1,IF(F84=SMALL((C84,F84,I84,L84,O84,R84),2),2,IF(F84=SMALL((C84,F84,I84,L84,O84,R84),3),3,IF(F84=SMALL((C84,F84,I84,L84,O84,R84),4),4,IF(F84=SMALL((C84,F84,I84,L84,O84,R84),5),5,IF(F84=SMALL((C84,F84,I84,L84,O84,R84),6),6)))))))","v":4},{"$f":"IF(ISTEXT(G83),0,7-G83)","v":3},{"$f":"IF(ISERROR(FIND(\"Relay\", $B84)),  IF('Lane 4'!$C81=\"Swimmer\", \"\", 'Lane 4'!$C81), \"Relay\")","v":"Sonny Butcher"},{"$f":"IF(OR(I84=\"DQ\",I84=\"DNS\"),\"-\",IF(I84=SMALL((C84,F84,I84,L84,O84,R84),1),1,IF(I84=SMALL((C84,F84,I84,L84,O84,R84),2),2,IF(I84=SMALL((C84,F84,I84,L84,O84,R84),3),3,IF(I84=SMALL((C84,F84,I84,L84,O84,R84),4),4,IF(I84=SMALL((C84,F84,I84,L84,O84,R84),5),5,IF(I84=SMALL((C84,F84,I84,L84,O84,R84),6),6)))))))","v":6},{"$f":"IF(ISTEXT(J83),0,7-J83)","v":1},{"$f":"IF(ISERROR(FIND(\"Relay\", $B84)),  IF('Lane 5'!$C81=\"Swimmer\", \"\", 'Lane 5'!$C81), \"Relay\")","v":"Issac Walton"},{"$f":"IF(OR(L84=\"DQ\",L84=\"DNS\"),\"-\",IF(L84=SMALL((C84,F84,I84,L84,O84,R84),1),1,IF(L84=SMALL((C84,F84,I84,L84,O84,R84),2),2,IF(L84=SMALL((C84,F84,I84,L84,O84,R84),3),3,IF(L84=SMALL((C84,F84,I84,L84,O84,R84),4),4,IF(L84=SMALL((C84,F84,I84,L84,O84,R84),5),5,IF(L84=SMALL((C84,F84,I84,L84,O84,R84),6),6)))))))","v":2},{"$f":"IF(ISTEXT(M83),0,7-M83)","v":5},{"$f":"IF(ISERROR(FIND(\"Relay\", $B84)),  IF('Lane 6'!$C81=\"Swimmer\", \"\", 'Lane 6'!$C81), \"Relay\")","v":"A Guild"},{"$f":"IF(OR(O84=\"DQ\",O84=\"DNS\"),\"-\",IF(O84=SMALL((C84,F84,I84,L84,O84,R84),1),1,IF(O84=SMALL((C84,F84,I84,L84,O84,R84),2),2,IF(O84=SMALL((C84,F84,I84,L84,O84,R84),3),3,IF(O84=SMALL((C84,F84,I84,L84,O84,R84),4),4,IF(O84=SMALL((C84,F84,I84,L84,O84,R84),5),5,IF(O84=SMALL((C84,F84,I84,L84,O84,R84),6),6)))))))","v":5},{"$f":"IF(ISTEXT(P83),0,7-P83)","v":2},{"$f":"IF(ISERROR(FIND(\"Relay\", $B84)),  IF('Lane 1'!$C81=\"Swimmer\", \"\", 'Lane 1'!$C81), \"Relay\")","v":"Harvie Lal"},{"$f":"IF(OR(R84=\"DQ\",R84=\"DNS\"),\"-\",IF(R84=SMALL((C84,F84,I84,L84,O84,R84),1),1,IF(R84=SMALL((C84,F84,I84,L84,O84,R84),2),2,IF(R84=SMALL((C84,F84,I84,L84,O84,R84),3),3,IF(R84=SMALL((C84,F84,I84,L84,O84,R84),4),4,IF(R84=SMALL((C84,F84,I84,L84,O84,R84),5),5,IF(R84=SMALL((C84,F84,I84,L84,O84,R84),6),6)))))))","v":1},{"$f":"IF(ISTEXT(S83),0,7-S83)","v":6},{"$f":"T83+Q83+N83+K83+H83+E83","v":21}]
[null,"Breaststroke","00:00:48.700",null,{"$f":"E82+E83","v":116},"00:00:49.460",null,{"$f":"H82+H83","v":179},"00:00:55.220",null,{"$f":"K82+K83","v":138},"00:00:48.560",null,{"$f":"N82+N83","v":91},"00:00:52.250",null,{"$f":"Q82+Q83","v":131},"00:00:46.250",null,{"$f":"T82+T83","v":145},null,{"$f":"V82+U83","v":800}]
[41,"G 11/u 2L",{"$f":"IF(ISERROR(FIND(\"Relay\", $B86)),  IF('Lane 2'!$C83=\"Swimmer\", \"\", 'Lane 2'!$C83), \"Relay\")","v":"Lilly Neal"},{"$f":"IF(OR(C86=\"DQ\",C86=\"DNS\"),\"-\",IF(C86=SMALL((C86,F86,I86,L86,O86,R86),1),1,IF(C86=SMALL((C86,F86,I86,L86,O86,R86),2),2,IF(C86=SMALL((C86,F86,I86,L86,O86,R86),3),3,IF(C86=SMALL((C86,F86,I86,L86,O86,R86),4),4,IF(C86=SMALL((C86,F86,I86,L86,O86,R86),5),5,IF(C86=SMALL((C86,F86,I86,L86,O86,R86),6),6)))))))","v":5},{"$f":"IF(ISTEXT(D85),0,7-D85)","v":2},{"$f":"IF(ISERROR(FIND(\"Relay\", $B86)),  IF('Lane 3'!$C83=\"Swimmer\", \"\", 'Lane 3'!$C83), \"Relay\")","v":"Sarah Hunt"},{"$f":"IF(OR(F86=\"DQ\",F86=\"DNS\"),\"-\",IF(F86=SMALL((C86,F86,I86,L86,O86,R86),1),1,IF(F86=SMALL((C86,F86,I86,L86,O86,R86),2),2,IF(F86=SMALL((C86,F86,I86,L86,O86,R86),3),3,IF(F86=SMALL((C86,F86,I86,L86,O86,R86),4),4,IF(F86=SMALL((C86,F86,I86,L86,O86,R86),5),5,IF(F86=SMALL((C86,F86,I86,L86,O86,R86),6),6)))))))","v":2},{"$f":"IF(ISTEXT(G85),0,7-G85)","v":5},{"$f":"IF(ISERROR(FIND(\"Relay\", $B86)),  IF('Lane 4'!$C83=\"Swimmer\", \"\", 'Lane 4'!$C83), \"Relay\")","v":"Megan O'Reilly"},{"$f":"IF(OR(I86=\"DQ\",I86=\"DNS\"),\"-\",IF(I86=SMALL((C86,F86,I86,L86,O86,R86),1),1,IF(I86=SMALL((C86,F86,I86,L86,O86,R86),2),2,IF(I86=SMALL((C86,F86,I86,L86,O86,R86),3),3,IF(I86=SMALL((C86,F86,I86,L86,O86,R86),4),4,IF(I86=SMALL((C86,F86,I86,L86,O86,R86),5),5,IF(I86=SMALL((C86,F86,I86,L86,O86,R86),6),6)))))))","v":3},{"$f":"IF(ISTEXT(J85),0,7-J85)","v":4},{"$f":"IF(ISERROR(FIND(\"Relay\", $B86)),  IF('Lane 5'!$C83=\"Swimmer\", \"\", 'Lane 5'!$C83), \"Relay\")","v":"Neveah Choudhury"},{"$f":"IF(OR(L86=\"DQ\",L86=\"DNS\"),\"-\",IF(L86=SMALL((C86,F86,I86,L86,O86,R86),1),1,IF(L86=SMALL((C86,F86,I86,L86,O86,R86),2),2,IF(L86=SMALL((C86,F86,I86,L86,O86,R86),3),3,IF(L86=SMALL((C86,F86,I86,L86,O86,R86),4),4,IF(L86=SMALL((C86,F86,I86,L86,O86,R86),5),5,IF(L86=SMALL((C86,F86,I86,L86,O86,R86),6),6)))))))","v":6},{"$f":"IF(ISTEXT(M85),0,7-M85)","v":1},{"$f":"IF(ISERROR(FIND(\"Relay\", $B86)),  IF('Lane 6'!$C83=\"Swimmer\", \"\", 'Lane 6'!$C83), \"Relay\")","v":"A Ingram"},{"$f":"IF(OR(O86=\"DQ\",O86=\"DNS\"),\"-\",IF(O86=SMALL((C86,F86,I86,L86,O86,R86),1),1,IF(O86=SMALL((C86,F86,I86,L86,O86,R86),2),2,IF(O86=SMALL((C86,F86,I86,L86,O86,R86),3),3,IF(O86=SMALL((C86,F86,I86,L86,O86,R86),4),4,IF(O86=SMALL((C86,F86,I86,L86,O86,R86),5),5,IF(O86=SMALL((C86,F86,I86,L86,O86,R86),6),6)))))))","v":4},{"$f":"IF(ISTEXT(P85),0,7-P85)","v":3},{"$f":"IF(ISERROR(FIND(\"Relay\", $B86)),  IF('Lane 1'!$C83=\"Swimmer\", \"\", 'Lane 1'!$C83), \"Relay\")","v":"Eva Browne"},{"$f":"IF(OR(R86=\"DQ\",R86=\"DNS\"),\"-\",IF(R86=SMALL((C86,F86,I86,L86,O86,R86),1),1,IF(R86=SMALL((C86,F86,I86,L86,O86,R86),2),2,IF(R86=SMALL((C86,F86,I86,L86,O86,R86),3),3,IF(R86=SMALL((C86,F86,I86,L86,O86,R86),4),4,IF(R86=SMALL((C86,F86,I86,L86,O86,R86),5),5,IF(R86=SMALL((C86,F86,I86,L86,O86,R86),6),6)))))))","v":1},{"$f":"IF(ISTEXT(S85),0,7-S85)","v":6},{"$f":"T85+Q85+N85+K85+H85+E85","v":21}]
[null,"Breaststroke","00:00:53.930",null,{"$f":"E84+E85","v":118},"00:00:51.810",null,{"$f":"H84+H85","v":184},"00:00:51.880",null,{"$f":"K84+K85","v":142},"00:01:04.870",null,{"$f":"N84+N85","v":92},"00:00:53.310",null,{"$f":"Q84+Q85","v":134},"00:00:49.310",null,{"$f":"T84+T85","v":151},null,{"$f":"V84+U85","v":821}]
[42,"B 8 x 1L ",{"$f":"IF(ISERROR(FIND(\"Relay\", $B88)),  IF('Lane 2'!$C85=\"Swimmer\", \"\", 'Lane 2'!$C85), \"Relay\")","v":"Relay"},{"$f":"IF(OR(C88=\"DQ\",C88=\"DNS\"),\"-\",IF(C88=SMALL((C88,F88,I88,L88,O88,R88),1),1,IF(C88=SMALL((C88,F88,I88,L88,O88,R88),2),2,IF(C88=SMALL((C88,F88,I88,L88,O88,R88),3),3,IF(C88=SMALL((C88,F88,I88,L88,O88,R88),4),4,IF(C88=SMALL((C88,F88,I88,L88,O88,R88),5),5,IF(C88=SMALL((C88,F88,I88,L88,O88,R88),6),6)))))))","v":5},{"$f":"IF(ISTEXT(D87),0,7-D87)","v":2},{"$f":"IF(ISERROR(FIND(\"Relay\", $B88)),  IF('Lane 3'!$C85=\"Swimmer\", \"\", 'Lane 3'!$C85), \"Relay\")","v":"Relay"},{"$f":"IF(OR(F88=\"DQ\",F88=\"DNS\"),\"-\",IF(F88=SMALL((C88,F88,I88,L88,O88,R88),1),1,IF(F88=SMALL((C88,F88,I88,L88,O88,R88),2),2,IF(F88=SMALL((C88,F88,I88,L88,O88,R88),3),3,IF(F88=SMALL((C88,F88,I88,L88,O88,R88),4),4,IF(F88=SMALL((C88,F88,I88,L88,O88,R88),5),5,IF(F88=SMALL((C88,F88,I88,L88,O88,R88),6),6)))))))","v":1},{"$f":"IF(ISTEXT(G87),0,7-G87)","v":6},{"$f":"IF(ISERROR(FIND(\"Relay\", $B88)),  IF('Lane 4'!$C85=\"Swimmer\", \"\", 'Lane 4'!$C85), \"Relay\")","v":"Relay"},{"$f":"IF(OR(I88=\"DQ\",I88=\"DNS\"),\"-\",IF(I88=SMALL((C88,F88,I88,L88,O88,R88),1),1,IF(I88=SMALL((C88,F88,I88,L88,O88,R88),2),2,IF(I88=SMALL((C88,F88,I88,L88,O88,R88),3),3,IF(I88=SMALL((C88,F88,I88,L88,O88,R88),4),4,IF(I88=SMALL((C88,F88,I88,L88,O88,R88),5),5,IF(I88=SMALL((C88,F88,I88,L88,O88,R88),6),6)))))))","v":4},{"$f":"IF(ISTEXT(J87),0,7-J87)","v":3},{"$f":"IF(ISERROR(FIND(\"Relay\", $B88)),  IF('Lane 5'!$C85=\"Swimmer\", \"\", 'Lane 5'!$C85), \"Relay\")","v":"Relay"},{"$f":"IF(OR(L88=\"DQ\",L88=\"DNS\"),\"-\",IF(L88=SMALL((C88,F88,I88,L88,O88,R88),1),1,IF(L88=SMALL((C88,F88,I88,L88,O88,R88),2),2,IF(L88=SMALL((C88,F88,I88,L88,O88,R88),3),3,IF(L88=SMALL((C88,F88,I88,L88,O88,R88),4),4,IF(L88=SMALL((C88,F88,I88,L88,O88,R88),5),5,IF(L88=SMALL((C88,F88,I88,L88,O88,R88),6),6)))))))","v":"-"},{"$f":"IF(ISTEXT(M87),0,7-M87)","v":0},{"$f":"IF(ISERROR(FIND(\"Relay\", $B88)),  IF('Lane 6'!$C85=\"Swimmer\", \"\", 'Lane 6'!$C85), \"Relay\")","v":"Relay"},{"$f":"IF(OR(O88=\"DQ\",O88=\"DNS\"),\"-\",IF(O88=SMALL((C88,F88,I88,L88,O88,R88),1),1,IF(O88=SMALL((C88,F88,I88,L88,O88,R88),2),2,IF(O88=SMALL((C88,F88,I88,L88,O88,R88),3),3,IF(O88=SMALL((C88,F88,I88,L88,O88,R88),4),4,IF(O88=SMALL((C88,F88,I88,L88,O88,R88),5),5,IF(O88=SMALL((C88,F88,I88,L88,O88,R88),6),6)))))))","v":3},{"$f":"IF(ISTEXT(P87),0,7-P87)","v":4},{"$f":"IF(ISERROR(FIND(\"Relay\", $B88)),  IF('Lane 1'!$D85=\"Swimmer\", \"\", 'Lane 1'!$D85), \"Relay\")","v":"Relay"},{"$f":"IF(OR(R88=\"DQ\",R88=\"DNS\"),\"-\",IF(R88=SMALL((C88,F88,I88,L88,O88,R88),1),1,IF(R88=SMALL((C88,F88,I88,L88,O88,R88),2),2,IF(R88=SMALL((C88,F88,I88,L88,O88,R88),3),3,IF(R88=SMALL((C88,F88,I88,L88,O88,R88),4),4,IF(R88=SMALL((C88,F88,I88,L88,O88,R88),5),5,IF(R88=SMALL((C88,F88,I88,L88,O88,R88),6),6)))))))","v":2},{"$f":"IF(ISTEXT(S87),0,7-S87)","v":5},{"$f":"T87+Q87+N87+K87+H87+E87","v":20}]
[null,"Freestyle Relay","00:02:48.690",null,{"$f":"E86+E87","v":120},"00:02:26.760",null,{"$f":"H86+H87","v":190},"00:02:41.110",null,{"$f":"K86+K87","v":145},"DNS",null,{"$f":"N86+N87","v":92},"00:02:35.750",null,{"$f":"Q86+Q87","v":138},"00:02:30.560",null,{"$f":"T86+T87","v":156},null,{"$f":"V86+U87","v":841}]
[43,"G 10/u 1L",{"$f":"IF(ISERROR(FIND(\"Relay\", $B90)),  IF('Lane 2'!$C87=\"Swimmer\", \"\", 'Lane 2'!$C87), \"Relay\")","v":"Faith Shepherd"},{"$f":"IF(OR(C90=\"DQ\",C90=\"DNS\"),\"-\",IF(C90=SMALL((C90,F90,I90,L90,O90,R90),1),1,IF(C90=SMALL((C90,F90,I90,L90,O90,R90),2),2,IF(C90=SMALL((C90,F90,I90,L90,O90,R90),3),3,IF(C90=SMALL((C90,F90,I90,L90,O90,R90),4),4,IF(C90=SMALL((C90,F90,I90,L90,O90,R90),5),5,IF(C90=SMALL((C90,F90,I90,L90,O90,R90),6),6)))))))","v":1},{"$f":"IF(ISTEXT(D89),0,7-D89)","v":6},{"$f":"IF(ISERROR(FIND(\"Relay\", $B90)),  IF('Lane 3'!$C87=\"Swimmer\", \"\", 'Lane 3'!$C87), \"Relay\")","v":"Hannah Johnson"},{"$f":"IF(OR(F90=\"DQ\",F90=\"DNS\"),\"-\",IF(F90=SMALL((C90,F90,I90,L90,O90,R90),1),1,IF(F90=SMALL((C90,F90,I90,L90,O90,R90),2),2,IF(F90=SMALL((C90,F90,I90,L90,O90,R90),3),3,IF(F90=SMALL((C90,F90,I90,L90,O90,R90),4),4,IF(F90=SMALL((C90,F90,I90,L90,O90,R90),5),5,IF(F90=SMALL((C90,F90,I90,L90,O90,R90),6),6)))))))","v":3},{"$f":"IF(ISTEXT(G89),0,7-G89)","v":4},{"$f":"IF(ISERROR(FIND(\"Relay\", $B90)),  IF('Lane 4'!$C87=\"Swimmer\", \"\", 'Lane 4'!$C87), \"Relay\")","v":"Ayla Goucher"},{"$f":"IF(OR(I90=\"DQ\",I90=\"DNS\"),\"-\",IF(I90=SMALL((C90,F90,I90,L90,O90,R90),1),1,IF(I90=SMALL((C90,F90,I90,L90,O90,R90),2),2,IF(I90=SMALL((C90,F90,I90,L90,O90,R90),3),3,IF(I90=SMALL((C90,F90,I90,L90,O90,R90),4),4,IF(I90=SMALL((C90,F90,I90,L90,O90,R90),5),5,IF(I90=SMALL((C90,F90,I90,L90,O90,R90),6),6)))))))","v":2},{"$f":"IF(ISTEXT(J89),0,7-J89)","v":5},{"$f":"IF(ISERROR(FIND(\"Relay\", $B90)),  IF('Lane 5'!$C87=\"Swimmer\", \"\", 'Lane 5'!$C87), \"Relay\")","v":"Kiyane Mesref"},{"$f":"IF(OR(L90=\"DQ\",L90=\"DNS\"),\"-\",IF(L90=SMALL((C90,F90,I90,L90,O90,R90),1),1,IF(L90=SMALL((C90,F90,I90,L90,O90,R90),2),2,IF(L90=SMALL((C90,F90,I90,L90,O90,R90),3),3,IF(L90=SMALL((C90,F90,I90,L90,O90,R90),4),4,IF(L90=SMALL((C90,F90,I90,L90,O90,R90),5),5,IF(L90=SMALL((C90,F90,I90,L90,O90,R90),6),6)))))))","v":5},{"$f":"IF(ISTEXT(M89),0,7-M89)","v":2},{"$f":"IF(ISERROR(FIND(\"Relay\", $B90)),  IF('Lane 6'!$C87=\"Swimmer\", \"\", 'Lane 6'!$C87), \"Relay\")","v":"00:00:00"},{"$f":"IF(OR(O90=\"DQ\",O90=\"DNS\"),\"-\",IF(O90=SMALL((C90,F90,I90,L90,O90,R90),1),1,IF(O90=SMALL((C90,F90,I90,L90,O90,R90),2),2,IF(O90=SMALL((C90,F90,I90,L90,O90,R90),3),3,IF(O90=SMALL((C90,F90,I90,L90,O90,R90),4),4,IF(O90=SMALL((C90,F90,I90,L90,O90,R90),5),5,IF(O90=SMALL((C90,F90,I90,L90,O90,R90),6),6)))))))","v":"-"},{"$f":"IF(ISTEXT(P89),0,7-P89)","v":0},{"$f":"IF(ISERROR(FIND(\"Relay\", $B90)),  IF('Lane 1'!$C87=\"Swimmer\", \"\", 'Lane 1'!$C87), \"Relay\")","v":"Amelie Hemmingway"},{"$f":"IF(OR(R90=\"DQ\",R90=\"DNS\"),\"-\",IF(R90=SMALL((C90,F90,I90,L90,O90,R90),1),1,IF(R90=SMALL((C90,F90,I90,L90,O90,R90),2),2,IF(R90=SMALL((C90,F90,I90,L90,O90,R90),3),3,IF(R90=SMALL((C90,F90,I90,L90,O90,R90),4),4,IF(R90=SMALL((C90,F90,I90,L90,O90,R90),5),5,IF(R90=SMALL((C90,F90,I90,L90,O90,R90),6),6)))))))","v":4},{"$f":"IF(ISTEXT(S89),0,7-S89)","v":3},{"$f":"T89+Q89+N89+K89+H89+E89","v":20}]
[null,"Butterfly","00:00:19.030",null,{"$f":"E88+E89","v":126},"00:00:23.330",null,{"$f":"H88+H89","v":194},"00:00:20.990",null,{"$f":"K88+K89","v":150},"00:00:42.120",null,{"$f":"N88+N89","v":94},"DNS",null,{"$f":"Q88+Q89","v":138},"00:00:25.650",null,{"$f":"T88+T89","v":159},null,{"$f":"V88+U89","v":861}]
[44,"B 10/u 1L ",{"$f":"IF(ISERROR(FIND(\"Relay\", $B92)),  IF('Lane 2'!$C89=\"Swimmer\", \"\", 'Lane 2'!$C89), \"Relay\")","v":"Christian Neal"},{"$f":"IF(OR(C92=\"DQ\",C92=\"DNS\"),\"-\",IF(C92=SMALL((C92,F92,I92,L92,O92,R92),1),1,IF(C92=SMALL((C92,F92,I92,L92,O92,R92),2),2,IF(C92=SMALL((C92,F92,I92,L92,O92,R92),3),3,IF(C92=SMALL((C92,F92,I92,L92,O92,R92),4),4,IF(C92=SMALL((C92,F92,I92,L92,O92,R92),5),5,IF(C92=SMALL((C92,F92,I92,L92,O92,R92),6),6)))))))","v":6},{"$f":"IF(ISTEXT(D91),0,7-D91)","v":1},{"$f":"IF(ISERROR(FIND(\"Relay\", $B92)),  IF('Lane 3'!$C89=\"Swimmer\", \"\", 'Lane 3'!$C89), \"Relay\")","v":"Christian Morgan"},{"$f":"IF(OR(F92=\"DQ\",F92=\"DNS\"),\"-\",IF(F92=SMALL((C92,F92,I92,L92,O92,R92),1),1,IF(F92=SMALL((C92,F92,I92,L92,O92,R92),2),2,IF(F92=SMALL((C92,F92,I92,L92,O92,R92),3),3,IF(F92=SMALL((C92,F92,I92,L92,O92,R92),4),4,IF(F92=SMALL((C92,F92,I92,L92,O92,R92),5),5,IF(F92=SMALL((C92,F92,I92,L92,O92,R92),6),6)))))))","v":5},{"$f":"IF(ISTEXT(G91),0,7-G91)","v":2},{"$f":"IF(ISERROR(FIND(\"Relay\", $B92)),  IF('Lane 4'!$C89=\"Swimmer\", \"\", 'Lane 4'!$C89), \"Relay\")","v":"Kieran O'Reilly"},{"$f":"IF(OR(I92=\"DQ\",I92=\"DNS\"),\"-\",IF(I92=SMALL((C92,F92,I92,L92,O92,R92),1),1,IF(I92=SMALL((C92,F92,I92,L92,O92,R92),2),2,IF(I92=SMALL((C92,F92,I92,L92,O92,R92),3),3,IF(I92=SMALL((C92,F92,I92,L92,O92,R92),4),4,IF(I92=SMALL((C92,F92,I92,L92,O92,R92),5),5,IF(I92=SMALL((C92,F92,I92,L92,O92,R92),6),6)))))))","v":2},{"$f":"IF(ISTEXT(J91),0,7-J91)","v":5},{"$f":"IF(ISERROR(FIND(\"Relay\", $B92)),  IF('Lane 5'!$C89=\"Swimmer\", \"\", 'Lane 5'!$C89), \"Relay\")","v":"Joe Box"},{"$f":"IF(OR(L92=\"DQ\",L92=\"DNS\"),\"-\",IF(L92=SMALL((C92,F92,I92,L92,O92,R92),1),1,IF(L92=SMALL((C92,F92,I92,L92,O92,R92),2),2,IF(L92=SMALL((C92,F92,I92,L92,O92,R92),3),3,IF(L92=SMALL((C92,F92,I92,L92,O92,R92),4),4,IF(L92=SMALL((C92,F92,I92,L92,O92,R92),5),5,IF(L92=SMALL((C92,F92,I92,L92,O92,R92),6),6)))))))","v":1},{"$f":"IF(ISTEXT(M91),0,7-M91)","v":6},{"$f":"IF(ISERROR(FIND(\"Relay\", $B92)),  IF('Lane 6'!$C89=\"Swimmer\", \"\", 'Lane 6'!$C89), \"Relay\")","v":"T Mobbs"},{"$f":"IF(OR(O92=\"DQ\",O92=\"DNS\"),\"-\",IF(O92=SMALL((C92,F92,I92,L92,O92,R92),1),1,IF(O92=SMALL((C92,F92,I92,L92,O92,R92),2),2,IF(O92=SMALL((C92,F92,I92,L92,O92,R92),3),3,IF(O92=SMALL((C92,F92,I92,L92,O92,R92),4),4,IF(O92=SMALL((C92,F92,I92,L92,O92,R92),5),5,IF(O92=SMALL((C92,F92,I92,L92,O92,R92),6),6)))))))","v":4},{"$f":"IF(ISTEXT(P91),0,7-P91)","v":3},{"$f":"IF(ISERROR(FIND(\"Relay\", $B92)),  IF('Lane 1'!$C89=\"Swimmer\", \"\", 'Lane 1'!$C89), \"Relay\")","v":"Willem Cunniffe"},{"$f":"IF(OR(R92=\"DQ\",R92=\"DNS\"),\"-\",IF(R92=SMALL((C92,F92,I92,L92,O92,R92),1),1,IF(R92=SMALL((C92,F92,I92,L92,O92,R92),2),2,IF(R92=SMALL((C92,F92,I92,L92,O92,R92),3),3,IF(R92=SMALL((C92,F92,I92,L92,O92,R92),4),4,IF(R92=SMALL((C92,F92,I92,L92,O92,R92),5),5,IF(R92=SMALL((C92,F92,I92,L92,O92,R92),6),6)))))))","v":3},{"$f":"IF(ISTEXT(S91),0,7-S91)","v":4},{"$f":"T91+Q91+N91+K91+H91+E91","v":21}]
[null,"Butterfly","00:00:31.490",null,{"$f":"E90+E91","v":127},"00:00:23.890",null,{"$f":"H90+H91","v":196},"00:00:19.370",null,{"$f":"K90+K91","v":155},"00:00:17.500",null,{"$f":"N90+N91","v":100},"00:00:21.910",null,{"$f":"Q90+Q91","v":141},"00:00:19.440",null,{"$f":"T90+T91","v":163},null,{"$f":"V90+U91","v":882}]
[45,"G 9yrs 1L",{"$f":"IF(ISERROR(FIND(\"Relay\", $B94)),  IF('Lane 2'!$C91=\"Swimmer\", \"\", 'Lane 2'!$C91), \"Relay\")","v":"Imogen Neal"},{"$f":"IF(OR(C94=\"DQ\",C94=\"DNS\"),\"-\",IF(C94=SMALL((C94,F94,I94,L94,O94,R94),1),1,IF(C94=SMALL((C94,F94,I94,L94,O94,R94),2),2,IF(C94=SMALL((C94,F94,I94,L94,O94,R94),3),3,IF(C94=SMALL((C94,F94,I94,L94,O94,R94),4),4,IF(C94=SMALL((C94,F94,I94,L94,O94,R94),5),5,IF(C94=SMALL((C94,F94,I94,L94,O94,R94),6),6)))))))","v":3},{"$f":"IF(ISTEXT(D93),0,7-D93)","v":4},{"$f":"IF(ISERROR(FIND(\"Relay\", $B94)),  IF('Lane 3'!$C91=\"Swimmer\", \"\", 'Lane 3'!$C91), \"Relay\")","v":"Esther McGeough"},{"$f":"IF(OR(F94=\"DQ\",F94=\"DNS\"),\"-\",IF(F94=SMALL((C94,F94,I94,L94,O94,R94),1),1,IF(F94=SMALL((C94,F94,I94,L94,O94,R94),2),2,IF(F94=SMALL((C94,F94,I94,L94,O94,R94),3),3,IF(F94=SMALL((C94,F94,I94,L94,O94,R94),4),4,IF(F94=SMALL((C94,F94,I94,L94,O94,R94),5),5,IF(F94=SMALL((C94,F94,I94,L94,O94,R94),6),6)))))))","v":5},{"$f":"IF(ISTEXT(G93),0,7-G93)","v":2},{"$f":"IF(ISERROR(FIND(\"Relay\", $B94)),  IF('Lane 4'!$C91=\"Swimmer\", \"\", 'Lane 4'!$C91), \"Relay\")","v":"Cassie Kelly-Cooper"},{"$f":"IF(OR(I94=\"DQ\",I94=\"DNS\"),\"-\",IF(I94=SMALL((C94,F94,I94,L94,O94,R94),1),1,IF(I94=SMALL((C94,F94,I94,L94,O94,R94),2),2,IF(I94=SMALL((C94,F94,I94,L94,O94,R94),3),3,IF(I94=SMALL((C94,F94,I94,L94,O94,R94),4),4,IF(I94=SMALL((C94,F94,I94,L94,O94,R94),5),5,IF(I94=SMALL((C94,F94,I94,L94,O94,R94),6),6)))))))","v":1},{"$f":"IF(ISTEXT(J93),0,7-J93)","v":6},{"$f":"IF(ISERROR(FIND(\"Relay\", $B94)),  IF('Lane 5'!$C91=\"Swimmer\", \"\", 'Lane 5'!$C91), \"Relay\")","v":"Ava Browne"},{"$f":"IF(OR(L94=\"DQ\",L94=\"DNS\"),\"-\",IF(L94=SMALL((C94,F94,I94,L94,O94,R94),1),1,IF(L94=SMALL((C94,F94,I94,L94,O94,R94),2),2,IF(L94=SMALL((C94,F94,I94,L94,O94,R94),3),3,IF(L94=SMALL((C94,F94,I94,L94,O94,R94),4),4,IF(L94=SMALL((C94,F94,I94,L94,O94,R94),5),5,IF(L94=SMALL((C94,F94,I94,L94,O94,R94),6),6)))))))","v":"-"},{"$f":"IF(ISTEXT(M93),0,7-M93)","v":0},{"$f":"IF(ISERROR(FIND(\"Relay\", $B94)),  IF('Lane 6'!$C91=\"Swimmer\", \"\", 'Lane 6'!$C91), \"Relay\")","v":"M Munslow"},{"$f":"IF(OR(O94=\"DQ\",O94=\"DNS\"),\"-\",IF(O94=SMALL((C94,F94,I94,L94,O94,R94),1),1,IF(O94=SMALL((C94,F94,I94,L94,O94,R94),2),2,IF(O94=SMALL((C94,F94,I94,L94,O94,R94),3),3,IF(O94=SMALL((C94,F94,I94,L94,O94,R94),4),4,IF(O94=SMALL((C94,F94,I94,L94,O94,R94),5),5,IF(O94=SMALL((C94,F94,I94,L94,O94,R94),6),6)))))))","v":4},{"$f":"IF(ISTEXT(P93),0,7-P93)","v":3},{"$f":"IF(ISERROR(FIND(\"Relay\", $B94)),  IF('Lane 1'!$C91=\"Swimmer\", \"\", 'Lane 1'!$C91), \"Relay\")","v":"Evie-May Smith"},{"$f":"IF(OR(R94=\"DQ\",R94=\"DNS\"),\"-\",IF(R94=SMALL((C94,F94,I94,L94,O94,R94),1),1,IF(R94=SMALL((C94,F94,I94,L94,O94,R94),2),2,IF(R94=SMALL((C94,F94,I94,L94,O94,R94),3),3,IF(R94=SMALL((C94,F94,I94,L94,O94,R94),4),4,IF(R94=SMALL((C94,F94,I94,L94,O94,R94),5),5,IF(R94=SMALL((C94,F94,I94,L94,O94,R94),6),6)))))))","v":2},{"$f":"IF(ISTEXT(S93),0,7-S93)","v":5},{"$f":"T93+Q93+N93+K93+H93+E93","v":20}]
[null,"Backstroke","00:00:24.400",null,{"$f":"E92+E93","v":131},"00:00:27.370",null,{"$f":"H92+H93","v":198},"00:00:24.200",null,{"$f":"K92+K93","v":161},"DQ",null,{"$f":"N92+N93","v":100},"00:00:25.340",null,{"$f":"Q92+Q93","v":144},"00:00:24.210",null,{"$f":"T92+T93","v":168},null,{"$f":"V92+U93","v":902}]
[46,"B 9 yrs 1L ",{"$f":"IF(ISERROR(FIND(\"Relay\", $B96)),  IF('Lane 2'!$C93=\"Swimmer\", \"\", 'Lane 2'!$C93), \"Relay\")","v":"Oscar Yates"},{"$f":"IF(OR(C96=\"DQ\",C96=\"DNS\"),\"-\",IF(C96=SMALL((C96,F96,I96,L96,O96,R96),1),1,IF(C96=SMALL((C96,F96,I96,L96,O96,R96),2),2,IF(C96=SMALL((C96,F96,I96,L96,O96,R96),3),3,IF(C96=SMALL((C96,F96,I96,L96,O96,R96),4),4,IF(C96=SMALL((C96,F96,I96,L96,O96,R96),5),5,IF(C96=SMALL((C96,F96,I96,L96,O96,R96),6),6)))))))","v":4},{"$f":"IF(ISTEXT(D95),0,7-D95)","v":3},{"$f":"IF(ISERROR(FIND(\"Relay\", $B96)),  IF('Lane 3'!$C93=\"Swimmer\", \"\", 'Lane 3'!$C93), \"Relay\")","v":"Callum Anderson"},{"$f":"IF(OR(F96=\"DQ\",F96=\"DNS\"),\"-\",IF(F96=SMALL((C96,F96,I96,L96,O96,R96),1),1,IF(F96=SMALL((C96,F96,I96,L96,O96,R96),2),2,IF(F96=SMALL((C96,F96,I96,L96,O96,R96),3),3,IF(F96=SMALL((C96,F96,I96,L96,O96,R96),4),4,IF(F96=SMALL((C96,F96,I96,L96,O96,R96),5),5,IF(F96=SMALL((C96,F96,I96,L96,O96,R96),6),6)))))))","v":2},{"$f":"IF(ISTEXT(G95),0,7-G95)","v":5},{"$f":"IF(ISERROR(FIND(\"Relay\", $B96)),  IF('Lane 4'!$C93=\"Swimmer\", \"\", 'Lane 4'!$C93), \"Relay\")","v":""},{"$f":"IF(OR(I96=\"DQ\",I96=\"DNS\"),\"-\",IF(I96=SMALL((C96,F96,I96,L96,O96,R96),1),1,IF(I96=SMALL((C96,F96,I96,L96,O96,R96),2),2,IF(I96=SMALL((C96,F96,I96,L96,O96,R96),3),3,IF(I96=SMALL((C96,F96,I96,L96,O96,R96),4),4,IF(I96=SMALL((C96,F96,I96,L96,O96,R96),5),5,IF(I96=SMALL((C96,F96,I96,L96,O96,R96),6),6)))))))","v":"-"},{"$f":"IF(ISTEXT(J95),0,7-J95)","v":0},{"$f":"IF(ISERROR(FIND(\"Relay\", $B96)),  IF('Lane 5'!$C93=\"Swimmer\", \"\", 'Lane 5'!$C93), \"Relay\")","v":"Luka Prodan"},{"$f":"IF(OR(L96=\"DQ\",L96=\"DNS\"),\"-\",IF(L96=SMALL((C96,F96,I96,L96,O96,R96),1),1,IF(L96=SMALL((C96,F96,I96,L96,O96,R96),2),2,IF(L96=SMALL((C96,F96,I96,L96,O96,R96),3),3,IF(L96=SMALL((C96,F96,I96,L96,O96,R96),4),4,IF(L96=SMALL((C96,F96,I96,L96,O96,R96),5),5,IF(L96=SMALL((C96,F96,I96,L96,O96,R96),6),6)))))))","v":"-"},{"$f":"IF(ISTEXT(M95),0,7-M95)","v":0},{"$f":"IF(ISERROR(FIND(\"Relay\", $B96)),  IF('Lane 6'!$C93=\"Swimmer\", \"\", 'Lane 6'!$C93), \"Relay\")","v":"N Kalitat"},{"$f":"IF(OR(O96=\"DQ\",O96=\"DNS\"),\"-\",IF(O96=SMALL((C96,F96,I96,L96,O96,R96),1),1,IF(O96=SMALL((C96,F96,I96,L96,O96,R96),2),2,IF(O96=SMALL((C96,F96,I96,L96,O96,R96),3),3,IF(O96=SMALL((C96,F96,I96,L96,O96,R96),4),4,IF(O96=SMALL((C96,F96,I96,L96,O96,R96),5),5,IF(O96=SMALL((C96,F96,I96,L96,O96,R96),6),6)))))))","v":3},{"$f":"IF(ISTEXT(P95),0,7-P95)","v":4},{"$f":"IF(ISERROR(FIND(\"Relay\", $B96)),  IF('Lane 1'!$C93=\"Swimmer\", \"\", 'Lane 1'!$C93), \"Relay\")","v":"Finley Cowdell"},{"$f":"IF(OR(R96=\"DQ\",R96=\"DNS\"),\"-\",IF(R96=SMALL((C96,F96,I96,L96,O96,R96),1),1,IF(R96=SMALL((C96,F96,I96,L96,O96,R96),2),2,IF(R96=SMALL((C96,F96,I96,L96,O96,R96),3),3,IF(R96=SMALL((C96,F96,I96,L96,O96,R96),4),4,IF(R96=SMALL((C96,F96,I96,L96,O96,R96),5),5,IF(R96=SMALL((C96,F96,I96,L96,O96,R96),6),6)))))))","v":1},{"$f":"IF(ISTEXT(S95),0,7-S95)","v":6},{"$f":"T95+Q95+N95+K95+H95+E95","v":18}]
[null,"Backstroke","00:00:29.470",null,{"$f":"E94+E95","v":134},"00:00:27.060",null,{"$f":"H94+H95","v":203},"DNS",null,{"$f":"K94+K95","v":161},"DNS",null,{"$f":"N94+N95","v":100},"00:00:27.470",null,{"$f":"Q94+Q95","v":148},"00:00:24.050",null,{"$f":"T94+T95","v":174},null,{"$f":"V94+U95","v":920}]
[47,"G 11/u 2L ",{"$f":"IF(ISERROR(FIND(\"Relay\", $B98)),  IF('Lane 2'!$C95=\"Swimmer\", \"\", 'Lane 2'!$C95), \"Relay\")","v":"Gracie Bull"},{"$f":"IF(OR(C98=\"DQ\",C98=\"DNS\"),\"-\",IF(C98=SMALL((C98,F98,I98,L98,O98,R98),1),1,IF(C98=SMALL((C98,F98,I98,L98,O98,R98),2),2,IF(C98=SMALL((C98,F98,I98,L98,O98,R98),3),3,IF(C98=SMALL((C98,F98,I98,L98,O98,R98),4),4,IF(C98=SMALL((C98,F98,I98,L98,O98,R98),5),5,IF(C98=SMALL((C98,F98,I98,L98,O98,R98),6),6)))))))","v":3},{"$f":"IF(ISTEXT(D97),0,7-D97)","v":4},{"$f":"IF(ISERROR(FIND(\"Relay\", $B98)),  IF('Lane 3'!$C95=\"Swimmer\", \"\", 'Lane 3'!$C95), \"Relay\")","v":"Molly Kirkland"},{"$f":"IF(OR(F98=\"DQ\",F98=\"DNS\"),\"-\",IF(F98=SMALL((C98,F98,I98,L98,O98,R98),1),1,IF(F98=SMALL((C98,F98,I98,L98,O98,R98),2),2,IF(F98=SMALL((C98,F98,I98,L98,O98,R98),3),3,IF(F98=SMALL((C98,F98,I98,L98,O98,R98),4),4,IF(F98=SMALL((C98,F98,I98,L98,O98,R98),5),5,IF(F98=SMALL((C98,F98,I98,L98,O98,R98),6),6)))))))","v":2},{"$f":"IF(ISTEXT(G97),0,7-G97)","v":5},{"$f":"IF(ISERROR(FIND(\"Relay\", $B98)),  IF('Lane 4'!$C95=\"Swimmer\", \"\", 'Lane 4'!$C95), \"Relay\")","v":"Cara Miller"},{"$f":"IF(OR(I98=\"DQ\",I98=\"DNS\"),\"-\",IF(I98=SMALL((C98,F98,I98,L98,O98,R98),1),1,IF(I98=SMALL((C98,F98,I98,L98,O98,R98),2),2,IF(I98=SMALL((C98,F98,I98,L98,O98,R98),3),3,IF(I98=SMALL((C98,F98,I98,L98,O98,R98),4),4,IF(I98=SMALL((C98,F98,I98,L98,O98,R98),5),5,IF(I98=SMALL((C98,F98,I98,L98,O98,R98),6),6)))))))","v":6},{"$f":"IF(ISTEXT(J97),0,7-J97)","v":1},{"$f":"IF(ISERROR(FIND(\"Relay\", $B98)),  IF('Lane 5'!$C95=\"Swimmer\", \"\", 'Lane 5'!$C95), \"Relay\")","v":"Indigo Perrett"},{"$f":"IF(OR(L98=\"DQ\",L98=\"DNS\"),\"-\",IF(L98=SMALL((C98,F98,I98,L98,O98,R98),1),1,IF(L98=SMALL((C98,F98,I98,L98,O98,R98),2),2,IF(L98=SMALL((C98,F98,I98,L98,O98,R98),3),3,IF(L98=SMALL((C98,F98,I98,L98,O98,R98),4),4,IF(L98=SMALL((C98,F98,I98,L98,O98,R98),5),5,IF(L98=SMALL((C98,F98,I98,L98,O98,R98),6),6)))))))","v":5},{"$f":"IF(ISTEXT(M97),0,7-M97)","v":2},{"$f":"IF(ISERROR(FIND(\"Relay\", $B98)),  IF('Lane 6'!$C95=\"Swimmer\", \"\", 'Lane 6'!$C95), \"Relay\")","v":"R Powell"},{"$f":"IF(OR(O98=\"DQ\",O98=\"DNS\"),\"-\",IF(O98=SMALL((C98,F98,I98,L98,O98,R98),1),1,IF(O98=SMALL((C98,F98,I98,L98,O98,R98),2),2,IF(O98=SMALL((C98,F98,I98,L98,O98,R98),3),3,IF(O98=SMALL((C98,F98,I98,L98,O98,R98),4),4,IF(O98=SMALL((C98,F98,I98,L98,O98,R98),5),5,IF(O98=SMALL((C98,F98,I98,L98,O98,R98),6),6)))))))","v":1},{"$f":"IF(ISTEXT(P97),0,7-P97)","v":6},{"$f":"IF(ISERROR(FIND(\"Relay\", $B98)),  IF('Lane 1'!$C95=\"Swimmer\", \"\", 'Lane 1'!$C95), \"Relay\")","v":"Hannah Norton"},{"$f":"IF(OR(R98=\"DQ\",R98=\"DNS\"),\"-\",IF(R98=SMALL((C98,F98,I98,L98,O98,R98),1),1,IF(R98=SMALL((C98,F98,I98,L98,O98,R98),2),2,IF(R98=SMALL((C98,F98,I98,L98,O98,R98),3),3,IF(R98=SMALL((C98,F98,I98,L98,O98,R98),4),4,IF(R98=SMALL((C98,F98,I98,L98,O98,R98),5),5,IF(R98=SMALL((C98,F98,I98,L98,O98,R98),6),6)))))))","v":4},{"$f":"IF(ISTEXT(S97),0,7-S97)","v":3},{"$f":"T97+Q97+N97+K97+H97+E97","v":21}]
[null,"Freestyle","00:00:41.460",null,{"$f":"E96+E97","v":138},"00:00:38.010",null,{"$f":"H96+H97","v":208},"00:00:50.460",null,{"$f":"K96+K97","v":162},"00:00:49.130",null,{"$f":"N96+N97","v":102},"00:00:37.850",null,{"$f":"Q96+Q97","v":154},"00:00:49",null,{"$f":"T96+T97","v":177},null,{"$f":"V96+U97","v":941}]
[48,"B 11/u 2L ",{"$f":"IF(ISERROR(FIND(\"Relay\", $B100)),  IF('Lane 2'!$C97=\"Swimmer\", \"\", 'Lane 2'!$C97), \"Relay\")","v":"Lachlin Woodend"},{"$f":"IF(OR(C100=\"DQ\",C100=\"DNS\"),\"-\",IF(C100=SMALL((C100,F100,I100,L100,O100,R100),1),1,IF(C100=SMALL((C100,F100,I100,L100,O100,R100),2),2,IF(C100=SMALL((C100,F100,I100,L100,O100,R100),3),3,IF(C100=SMALL((C100,F100,I100,L100,O100,R100),4),4,IF(C100=SMALL((C100,F100,I100,L100,O100,R100),5),5,IF(C100=SMALL((C100,F100,I100,L100,O100,R100),6),6)))))))","v":6},{"$f":"IF(ISTEXT(D99),0,7-D99)","v":1},{"$f":"IF(ISERROR(FIND(\"Relay\", $B100)),  IF('Lane 3'!$C97=\"Swimmer\", \"\", 'Lane 3'!$C97), \"Relay\")","v":"Sam Withey"},{"$f":"IF(OR(F100=\"DQ\",F100=\"DNS\"),\"-\",IF(F100=SMALL((C100,F100,I100,L100,O100,R100),1),1,IF(F100=SMALL((C100,F100,I100,L100,O100,R100),2),2,IF(F100=SMALL((C100,F100,I100,L100,O100,R100),3),3,IF(F100=SMALL((C100,F100,I100,L100,O100,R100),4),4,IF(F100=SMALL((C100,F100,I100,L100,O100,R100),5),5,IF(F100=SMALL((C100,F100,I100,L100,O100,R100),6),6)))))))","v":1},{"$f":"IF(ISTEXT(G99),0,7-G99)","v":6},{"$f":"IF(ISERROR(FIND(\"Relay\", $B100)),  IF('Lane 4'!$C97=\"Swimmer\", \"\", 'Lane 4'!$C97), \"Relay\")","v":"Thomas Ribchester"},{"$f":"IF(OR(I100=\"DQ\",I100=\"DNS\"),\"-\",IF(I100=SMALL((C100,F100,I100,L100,O100,R100),1),1,IF(I100=SMALL((C100,F100,I100,L100,O100,R100),2),2,IF(I100=SMALL((C100,F100,I100,L100,O100,R100),3),3,IF(I100=SMALL((C100,F100,I100,L100,O100,R100),4),4,IF(I100=SMALL((C100,F100,I100,L100,O100,R100),5),5,IF(I100=SMALL((C100,F100,I100,L100,O100,R100),6),6)))))))","v":3},{"$f":"IF(ISTEXT(J99),0,7-J99)","v":4},{"$f":"IF(ISERROR(FIND(\"Relay\", $B100)),  IF('Lane 5'!$C97=\"Swimmer\", \"\", 'Lane 5'!$C97), \"Relay\")","v":"Riley Talbot-Fielding"},{"$f":"IF(OR(L100=\"DQ\",L100=\"DNS\"),\"-\",IF(L100=SMALL((C100,F100,I100,L100,O100,R100),1),1,IF(L100=SMALL((C100,F100,I100,L100,O100,R100),2),2,IF(L100=SMALL((C100,F100,I100,L100,O100,R100),3),3,IF(L100=SMALL((C100,F100,I100,L100,O100,R100),4),4,IF(L100=SMALL((C100,F100,I100,L100,O100,R100),5),5,IF(L100=SMALL((C100,F100,I100,L100,O100,R100),6),6)))))))","v":5},{"$f":"IF(ISTEXT(M99),0,7-M99)","v":2},{"$f":"IF(ISERROR(FIND(\"Relay\", $B100)),  IF('Lane 6'!$C97=\"Swimmer\", \"\", 'Lane 6'!$C97), \"Relay\")","v":"B Webb"},{"$f":"IF(OR(O100=\"DQ\",O100=\"DNS\"),\"-\",IF(O100=SMALL((C100,F100,I100,L100,O100,R100),1),1,IF(O100=SMALL((C100,F100,I100,L100,O100,R100),2),2,IF(O100=SMALL((C100,F100,I100,L100,O100,R100),3),3,IF(O100=SMALL((C100,F100,I100,L100,O100,R100),4),4,IF(O100=SMALL((C100,F100,I100,L100,O100,R100),5),5,IF(O100=SMALL((C100,F100,I100,L100,O100,R100),6),6)))))))","v":2},{"$f":"IF(ISTEXT(P99),0,7-P99)","v":5},{"$f":"IF(ISERROR(FIND(\"Relay\", $B100)),  IF('Lane 1'!$C97=\"Swimmer\", \"\", 'Lane 1'!$C97), \"Relay\")","v":"Tom Lucas"},{"$f":"IF(OR(R100=\"DQ\",R100=\"DNS\"),\"-\",IF(R100=SMALL((C100,F100,I100,L100,O100,R100),1),1,IF(R100=SMALL((C100,F100,I100,L100,O100,R100),2),2,IF(R100=SMALL((C100,F100,I100,L100,O100,R100),3),3,IF(R100=SMALL((C100,F100,I100,L100,O100,R100),4),4,IF(R100=SMALL((C100,F100,I100,L100,O100,R100),5),5,IF(R100=SMALL((C100,F100,I100,L100,O100,R100),6),6)))))))","v":4},{"$f":"IF(ISTEXT(S99),0,7-S99)","v":3},{"$f":"T99+Q99+N99+K99+H99+E99","v":21}]
[null,"Freestyle","00:00:40.020",null,{"$f":"E98+E99","v":139},"00:00:33",null,{"$f":"H98+H99","v":214},"00:00:36.720",null,{"$f":"K98+K99","v":166},"00:00:39.750",null,{"$f":"N98+N99","v":104},"00:00:33.500",null,{"$f":"Q98+Q99","v":159},"00:00:37.580",null,{"$f":"T98+T99","v":180},null,{"$f":"V98+U99","v":962}]
[49,"G 12/u 4x1L ",{"$f":"IF(ISERROR(FIND(\"Relay\", $B102)),  IF('Lane 2'!$C99=\"Swimmer\", \"\", 'Lane 2'!$C99), \"Relay\")","v":"Relay"},{"$f":"IF(OR(C102=\"DQ\",C102=\"DNS\"),\"-\",IF(C102=SMALL((C102,F102,I102,L102,O102,R102),1),1,IF(C102=SMALL((C102,F102,I102,L102,O102,R102),2),2,IF(C102=SMALL((C102,F102,I102,L102,O102,R102),3),3,IF(C102=SMALL((C102,F102,I102,L102,O102,R102),4),4,IF(C102=SMALL((C102,F102,I102,L102,O102,R102),5),5,IF(C102=SMALL((C102,F102,I102,L102,O102,R102),6),6)))))))","v":6},{"$f":"IF(ISTEXT(D101),0,7-D101)","v":1},{"$f":"IF(ISERROR(FIND(\"Relay\", $B102)),  IF('Lane 3'!$C99=\"Swimmer\", \"\", 'Lane 3'!$C99), \"Relay\")","v":"Relay"},{"$f":"IF(OR(F102=\"DQ\",F102=\"DNS\"),\"-\",IF(F102=SMALL((C102,F102,I102,L102,O102,R102),1),1,IF(F102=SMALL((C102,F102,I102,L102,O102,R102),2),2,IF(F102=SMALL((C102,F102,I102,L102,O102,R102),3),3,IF(F102=SMALL((C102,F102,I102,L102,O102,R102),4),4,IF(F102=SMALL((C102,F102,I102,L102,O102,R102),5),5,IF(F102=SMALL((C102,F102,I102,L102,O102,R102),6),6)))))))","v":5},{"$f":"IF(ISTEXT(G101),0,7-G101)","v":2},{"$f":"IF(ISERROR(FIND(\"Relay\", $B102)),  IF('Lane 4'!$C99=\"Swimmer\", \"\", 'Lane 4'!$C99), \"Relay\")","v":"Relay"},{"$f":"IF(OR(I102=\"DQ\",I102=\"DNS\"),\"-\",IF(I102=SMALL((C102,F102,I102,L102,O102,R102),1),1,IF(I102=SMALL((C102,F102,I102,L102,O102,R102),2),2,IF(I102=SMALL((C102,F102,I102,L102,O102,R102),3),3,IF(I102=SMALL((C102,F102,I102,L102,O102,R102),4),4,IF(I102=SMALL((C102,F102,I102,L102,O102,R102),5),5,IF(I102=SMALL((C102,F102,I102,L102,O102,R102),6),6)))))))","v":2},{"$f":"IF(ISTEXT(J101),0,7-J101)","v":5},{"$f":"IF(ISERROR(FIND(\"Relay\", $B102)),  IF('Lane 5'!$C99=\"Swimmer\", \"\", 'Lane 5'!$C99), \"Relay\")","v":"Relay"},{"$f":"IF(OR(L102=\"DQ\",L102=\"DNS\"),\"-\",IF(L102=SMALL((C102,F102,I102,L102,O102,R102),1),1,IF(L102=SMALL((C102,F102,I102,L102,O102,R102),2),2,IF(L102=SMALL((C102,F102,I102,L102,O102,R102),3),3,IF(L102=SMALL((C102,F102,I102,L102,O102,R102),4),4,IF(L102=SMALL((C102,F102,I102,L102,O102,R102),5),5,IF(L102=SMALL((C102,F102,I102,L102,O102,R102),6),6)))))))","v":1},{"$f":"IF(ISTEXT(M101),0,7-M101)","v":6},{"$f":"IF(ISERROR(FIND(\"Relay\", $B102)),  IF('Lane 6'!$C99=\"Swimmer\", \"\", 'Lane 6'!$C99), \"Relay\")","v":"Relay"},{"$f":"IF(OR(O102=\"DQ\",O102=\"DNS\"),\"-\",IF(O102=SMALL((C102,F102,I102,L102,O102,R102),1),1,IF(O102=SMALL((C102,F102,I102,L102,O102,R102),2),2,IF(O102=SMALL((C102,F102,I102,L102,O102,R102),3),3,IF(O102=SMALL((C102,F102,I102,L102,O102,R102),4),4,IF(O102=SMALL((C102,F102,I102,L102,O102,R102),5),5,IF(O102=SMALL((C102,F102,I102,L102,O102,R102),6),6)))))))","v":4},{"$f":"IF(ISTEXT(P101),0,7-P101)","v":3},{"$f":"IF(ISERROR(FIND(\"Relay\", $B102)),  IF('Lane 1'!$D99=\"Swimmer\", \"\", 'Lane 1'!$D99), \"Relay\")","v":"Relay"},{"$f":"IF(OR(R102=\"DQ\",R102=\"DNS\"),\"-\",IF(R102=SMALL((C102,F102,I102,L102,O102,R102),1),1,IF(R102=SMALL((C102,F102,I102,L102,O102,R102),2),2,IF(R102=SMALL((C102,F102,I102,L102,O102,R102),3),3,IF(R102=SMALL((C102,F102,I102,L102,O102,R102),4),4,IF(R102=SMALL((C102,F102,I102,L102,O102,R102),5),5,IF(R102=SMALL((C102,F102,I102,L102,O102,R102),6),6)))))))","v":3},{"$f":"IF(ISTEXT(S101),0,7-S101)","v":4},{"$f":"T101+Q101+N101+K101+H101+E101","v":21}]
[null,"Medley Relay","00:01:27.030",null,{"$f":"E100+E101","v":140},"00:01:25.380",null,{"$f":"H100+H101","v":216},"00:01:20.380",null,{"$f":"K100+K101","v":171},"00:01:12.500",null,{"$f":"N100+N101","v":110},"00:01:24.960",null,{"$f":"Q100+Q101","v":162},"00:01:23.090",null,{"$f":"T100+T101","v":184},null,{"$f":"V100+U101","v":983}]
[50,"B 12/u 4x1L",{"$f":"IF(ISERROR(FIND(\"Relay\", $B104)),  IF('Lane 2'!$C101=\"Swimmer\", \"\", 'Lane 2'!$C101), \"Relay\")","v":"Relay"},{"$f":"IF(OR(C104=\"DQ\",C104=\"DNS\"),\"-\",IF(C104=SMALL((C104,F104,I104,L104,O104,R104),1),1,IF(C104=SMALL((C104,F104,I104,L104,O104,R104),2),2,IF(C104=SMALL((C104,F104,I104,L104,O104,R104),3),3,IF(C104=SMALL((C104,F104,I104,L104,O104,R104),4),4,IF(C104=SMALL((C104,F104,I104,L104,O104,R104),5),5,IF(C104=SMALL((C104,F104,I104,L104,O104,R104),6),6)))))))","v":6},{"$f":"IF(ISTEXT(D103),0,7-D103)","v":1},{"$f":"IF(ISERROR(FIND(\"Relay\", $B104)),  IF('Lane 3'!$C101=\"Swimmer\", \"\", 'Lane 3'!$C101), \"Relay\")","v":"Relay"},{"$f":"IF(OR(F104=\"DQ\",F104=\"DNS\"),\"-\",IF(F104=SMALL((C104,F104,I104,L104,O104,R104),1),1,IF(F104=SMALL((C104,F104,I104,L104,O104,R104),2),2,IF(F104=SMALL((C104,F104,I104,L104,O104,R104),3),3,IF(F104=SMALL((C104,F104,I104,L104,O104,R104),4),4,IF(F104=SMALL((C104,F104,I104,L104,O104,R104),5),5,IF(F104=SMALL((C104,F104,I104,L104,O104,R104),6),6)))))))","v":2},{"$f":"IF(ISTEXT(G103),0,7-G103)","v":5},{"$f":"IF(ISERROR(FIND(\"Relay\", $B104)),  IF('Lane 4'!$C101=\"Swimmer\", \"\", 'Lane 4'!$C101), \"Relay\")","v":"Relay"},{"$f":"IF(OR(I104=\"DQ\",I104=\"DNS\"),\"-\",IF(I104=SMALL((C104,F104,I104,L104,O104,R104),1),1,IF(I104=SMALL((C104,F104,I104,L104,O104,R104),2),2,IF(I104=SMALL((C104,F104,I104,L104,O104,R104),3),3,IF(I104=SMALL((C104,F104,I104,L104,O104,R104),4),4,IF(I104=SMALL((C104,F104,I104,L104,O104,R104),5),5,IF(I104=SMALL((C104,F104,I104,L104,O104,R104),6),6)))))))","v":1},{"$f":"IF(ISTEXT(J103),0,7-J103)","v":6},{"$f":"IF(ISERROR(FIND(\"Relay\", $B104)),  IF('Lane 5'!$C101=\"Swimmer\", \"\", 'Lane 5'!$C101), \"Relay\")","v":"Relay"},{"$f":"IF(OR(L104=\"DQ\",L104=\"DNS\"),\"-\",IF(L104=SMALL((C104,F104,I104,L104,O104,R104),1),1,IF(L104=SMALL((C104,F104,I104,L104,O104,R104),2),2,IF(L104=SMALL((C104,F104,I104,L104,O104,R104),3),3,IF(L104=SMALL((C104,F104,I104,L104,O104,R104),4),4,IF(L104=SMALL((C104,F104,I104,L104,O104,R104),5),5,IF(L104=SMALL((C104,F104,I104,L104,O104,R104),6),6)))))))","v":3},{"$f":"IF(ISTEXT(M103),0,7-M103)","v":4},{"$f":"IF(ISERROR(FIND(\"Relay\", $B104)),  IF('Lane 6'!$C101=\"Swimmer\", \"\", 'Lane 6'!$C101), \"Relay\")","v":"Relay"},{"$f":"IF(OR(O104=\"DQ\",O104=\"DNS\"),\"-\",IF(O104=SMALL((C104,F104,I104,L104,O104,R104),1),1,IF(O104=SMALL((C104,F104,I104,L104,O104,R104),2),2,IF(O104=SMALL((C104,F104,I104,L104,O104,R104),3),3,IF(O104=SMALL((C104,F104,I104,L104,O104,R104),4),4,IF(O104=SMALL((C104,F104,I104,L104,O104,R104),5),5,IF(O104=SMALL((C104,F104,I104,L104,O104,R104),6),6)))))))","v":5},{"$f":"IF(ISTEXT(P103),0,7-P103)","v":2},{"$f":"IF(ISERROR(FIND(\"Relay\", $B104)),  IF('Lane 1'!$D101=\"Swimmer\", \"\", 'Lane 1'!$D101), \"Relay\")","v":"Relay"},{"$f":"IF(OR(R104=\"DQ\",R104=\"DNS\"),\"-\",IF(R104=SMALL((C104,F104,I104,L104,O104,R104),1),1,IF(R104=SMALL((C104,F104,I104,L104,O104,R104),2),2,IF(R104=SMALL((C104,F104,I104,L104,O104,R104),3),3,IF(R104=SMALL((C104,F104,I104,L104,O104,R104),4),4,IF(R104=SMALL((C104,F104,I104,L104,O104,R104),5),5,IF(R104=SMALL((C104,F104,I104,L104,O104,R104),6),6)))))))","v":4},{"$f":"IF(ISTEXT(S103),0,7-S103)","v":3},{"$f":"T103+Q103+N103+K103+H103+E103","v":21}]
[null,"Medley Relay","00:01:24.540",null,{"$f":"E102+E103","v":141},"00:01:17.880",null,{"$f":"H102+H103","v":221},"00:01:14",null,{"$f":"K102+K103","v":177},"00:01:19.190",null,{"$f":"N102+N103","v":114},"00:01:22.820",null,{"$f":"Q102+Q103","v":164},"00:01:22.580",null,{"$f":"T102+T103","v":187},null,{"$f":"V102+U103","v":1004}]
[51,"Mixed 8x1L Freestyle",{"$f":"IF(ISERROR(FIND(\"Relay\", $B106)),  IF('Lane 2'!$C103=\"Swimmer\", \"\", 'Lane 2'!$C103), \"Relay\")","v":"Relay"},{"$f":"IF(OR(C106=\"DQ\",C106=\"DNS\"),\"-\",IF(C106=SMALL((C106,F106,I106,L106,O106,R106),1),1,IF(C106=SMALL((C106,F106,I106,L106,O106,R106),2),2,IF(C106=SMALL((C106,F106,I106,L106,O106,R106),3),3,IF(C106=SMALL((C106,F106,I106,L106,O106,R106),4),4,IF(C106=SMALL((C106,F106,I106,L106,O106,R106),5),5,IF(C106=SMALL((C106,F106,I106,L106,O106,R106),6),6)))))))","v":5},{"$f":"IF(ISTEXT(D105),0,7-D105)","v":2},{"$f":"IF(ISERROR(FIND(\"Relay\", $B106)),  IF('Lane 3'!$C103=\"Swimmer\", \"\", 'Lane 3'!$C103), \"Relay\")","v":"Relay"},{"$f":"IF(OR(F106=\"DQ\",F106=\"DNS\"),\"-\",IF(F106=SMALL((C106,F106,I106,L106,O106,R106),1),1,IF(F106=SMALL((C106,F106,I106,L106,O106,R106),2),2,IF(F106=SMALL((C106,F106,I106,L106,O106,R106),3),3,IF(F106=SMALL((C106,F106,I106,L106,O106,R106),4),4,IF(F106=SMALL((C106,F106,I106,L106,O106,R106),5),5,IF(F106=SMALL((C106,F106,I106,L106,O106,R106),6),6)))))))","v":1},{"$f":"IF(ISTEXT(G105),0,7-G105)","v":6},{"$f":"IF(ISERROR(FIND(\"Relay\", $B106)),  IF('Lane 4'!$C103=\"Swimmer\", \"\", 'Lane 4'!$C103), \"Relay\")","v":"Relay"},{"$f":"IF(OR(I106=\"DQ\",I106=\"DNS\"),\"-\",IF(I106=SMALL((C106,F106,I106,L106,O106,R106),1),1,IF(I106=SMALL((C106,F106,I106,L106,O106,R106),2),2,IF(I106=SMALL((C106,F106,I106,L106,O106,R106),3),3,IF(I106=SMALL((C106,F106,I106,L106,O106,R106),4),4,IF(I106=SMALL((C106,F106,I106,L106,O106,R106),5),5,IF(I106=SMALL((C106,F106,I106,L106,O106,R106),6),6)))))))","v":4},{"$f":"IF(ISTEXT(J105),0,7-J105)","v":3},{"$f":"IF(ISERROR(FIND(\"Relay\", $B106)),  IF('Lane 5'!$C103=\"Swimmer\", \"\", 'Lane 5'!$C103), \"Relay\")","v":"Relay"},{"$f":"IF(OR(L106=\"DQ\",L106=\"DNS\"),\"-\",IF(L106=SMALL((C106,F106,I106,L106,O106,R106),1),1,IF(L106=SMALL((C106,F106,I106,L106,O106,R106),2),2,IF(L106=SMALL((C106,F106,I106,L106,O106,R106),3),3,IF(L106=SMALL((C106,F106,I106,L106,O106,R106),4),4,IF(L106=SMALL((C106,F106,I106,L106,O106,R106),5),5,IF(L106=SMALL((C106,F106,I106,L106,O106,R106),6),6)))))))","v":2},{"$f":"IF(ISTEXT(M105),0,7-M105)","v":5},{"$f":"IF(ISERROR(FIND(\"Relay\", $B106)),  IF('Lane 6'!$C103=\"Swimmer\", \"\", 'Lane 6'!$C103), \"Relay\")","v":"Relay"},{"$f":"IF(OR(O106=\"DQ\",O106=\"DNS\"),\"-\",IF(O106=SMALL((C106,F106,I106,L106,O106,R106),1),1,IF(O106=SMALL((C106,F106,I106,L106,O106,R106),2),2,IF(O106=SMALL((C106,F106,I106,L106,O106,R106),3),3,IF(O106=SMALL((C106,F106,I106,L106,O106,R106),4),4,IF(O106=SMALL((C106,F106,I106,L106,O106,R106),5),5,IF(O106=SMALL((C106,F106,I106,L106,O106,R106),6),6)))))))","v":6},{"$f":"IF(ISTEXT(P105),0,7-P105)","v":1},{"$f":"IF(ISERROR(FIND(\"Relay\", $B106)),  IF('Lane 1'!$D103=\"Swimmer\", \"\", 'Lane 1'!$D103), \"Relay\")","v":"Relay"},{"$f":"IF(OR(R106=\"DQ\",R106=\"DNS\"),\"-\",IF(R106=SMALL((C106,F106,I106,L106,O106,R106),1),1,IF(R106=SMALL((C106,F106,I106,L106,O106,R106),2),2,IF(R106=SMALL((C106,F106,I106,L106,O106,R106),3),3,IF(R106=SMALL((C106,F106,I106,L106,O106,R106),4),4,IF(R106=SMALL((C106,F106,I106,L106,O106,R106),5),5,IF(R106=SMALL((C106,F106,I106,L106,O106,R106),6),6)))))))","v":3},{"$f":"IF(ISTEXT(S105),0,7-S105)","v":4},{"$f":"T105+Q105+N105+K105+H105+E105","v":21}]
[null,"Relay (1G+1B each age group)","00:02:33.850",null,{"$f":"E104+E105","v":143},"00:02:18.840",null,{"$f":"H104+H105","v":227},"00:02:33.840",null,{"$f":"K104+K105","v":180},"00:02:32.750",null,{"$f":"N104+N105","v":119},"00:02:37.320",null,{"$f":"Q104+Q105","v":165},"00:02:33.150",null,{"$f":"T104+T105","v":191},null,{"$f":"V104+U105","v":1025}]
[null,"FINAL POINTS",null,null,{"$f":"SUM(E106)","v":143},null,null,{"$f":"SUM(H106)","v":227},null,null,{"$f":"SUM(K106)","v":180},null,null,{"$f":"SUM(N106)","v":119},null,null,{"$f":"SUM(Q106)","v":165},null,null,{"$f":"SUM(T106)","v":191}]
[null,null,null,null,{"$f":"RANK(E107,$E$107:$T$107)","v":5},null,null,{"$f":"RANK(H107,$E$107:$T$107)","v":1},null,null,{"$f":"RANK(K107,$E$107:$T$107)","v":3},null,null,{"$f":"RANK(N107,$E$107:$T$107)","v":6},null,null,{"$f":"RANK(Q107,$E$107:$T$107)","v":4},null,null,{"$f":"RANK(T107,$E$107:$T$107)","v":2}]
["Lane","Points after: 12",null,null,null,null,null,"Final Results",null,null,null,"Gala Points"]
[1,{"$f":"C4","v":""},{"$f":"E28","v":43},null,null,null,null,"1st"]
[2,{"$f":"F4","v":""},{"$f":"H28","v":46},null,null,null,null,"2nd"]
[3,{"$f":"I4","v":""},{"$f":"K28","v":36},null,null,null,null,"3rd"]
[4,{"$f":"L4","v":""},{"$f":"N28","v":29},null,null,null,null,"4th"]
[5,{"$f":"O4","v":""},{"$f":"Q28","v":41},null,null,null,null,"5th"]
[6,{"$f":"R4","v":""},{"$f":"T28","v":46},null,null,null,null,"6th"]
[null,"Check:",{"$f":"SUM(C110:C115)","v":241}]
[]
["Lane","Points after: 24",null,null,null,null,null,"Lane","Points after: 36"]
[1,{"$f":"C4","v":""},{"$f":"E52","v":72},null,null,null,null,1,{"$f":"$C$4","v":""},null,null,{"$f":"E76","v":109}]
[2,{"$f":"F4","v":""},{"$f":"H52","v":104},null,null,null,null,2,{"$f":"$F$4","v":""},null,null,{"$f":"H76","v":162}]
[3,{"$f":"I4","v":""},{"$f":"K52","v":85},null,null,null,null,3,{"$f":"$I$4","v":""},null,null,{"$f":"K76","v":120}]
[4,{"$f":"L4","v":""},{"$f":"N52","v":54},null,null,null,null,4,{"$f":"$L$4","v":""},null,null,{"$f":"M76","v":0}]
[5,{"$f":"O4","v":""},{"$f":"Q52","v":76},null,null,null,null,5,{"$f":"$O$4","v":""},null,null,{"$f":"P76","v":0}]
[6,{"$f":"R4","v":""},{"$f":"T52","v":90},null,null,null,null,6,{"$f":"$R$4","v":""},null,null,{"$f":"S76","v":0}]
[null,"Check:",{"$f":"SUM(C119:C124)","v":481},null,null,null,null,null,"Check:",null,null,{"$f":"SUM(L119:L124)","v":391}]

{"sheet":"FIRSTS","index":1,"n_rows":108,"n_cols":8,"rows_kept":108,"cut":false,"hidden":false,"merged":[]}
["No","Event","Lane 1 -","Lane 2 - ","Lane 3 - ","Lane 4 - ","Lane 5 - ","Lane 6 - "]
[null,null,"Position","Position","Position","Position","Position","Position"]
[null,"Club Name",{"$f":"GALA!C4","v":""},{"$f":"GALA!F4","v":""},{"$f":"GALA!I4","v":""},{"$f":"GALA!L4","v":""},{"$f":"GALA!O4","v":""},{"$f":"GALA!R4","v":""}]
[1,"G 10yrs 2L ",{"$f":"GALA!D5","v":1},{"$f":"GALA!G5","v":2},{"$f":"GALA!J5","v":3},{"$f":"GALA!M5","v":5},{"$f":"GALA!P5","v":6},{"$f":"GALA!S5","v":4}]
[null,"Freestyle"]
[2,"B 10 yrs 2L ",{"$f":"GALA!D7","v":"-"},{"$f":"GALA!G7","v":4},{"$f":"GALA!J7","v":3},{"$f":"GALA!M7","v":2},{"$f":"GALA!P7","v":1},{"$f":"GALA!S7","v":5}]
[null,"Freestyle"]
[3,"G 9 yrs 1L",{"$f":"GALA!D9","v":1},{"$f":"GALA!G9","v":5},{"$f":"GALA!J9","v":2},{"$f":"GALA!M9","v":6},{"$f":"GALA!P9","v":4},{"$f":"GALA!S9","v":3}]
[null,"Breaststroke"]
[4,"B 9 yrs 1L",{"$f":"GALA!D11","v":5},{"$f":"GALA!G11","v":4},{"$f":"GALA!J11","v":"-"},{"$f":"GALA!M11","v":1},{"$f":"GALA!P11","v":2},{"$f":"GALA!S11","v":3}]
[null,"Breaststroke"]
[5,"G 11/u 4 x 1L ",{"$f":"GALA!D13","v":4},{"$f":"GALA!G13","v":2},{"$f":"GALA!J13","v":3},{"$f":"GALA!M13","v":6},{"$f":"GALA!P13","v":1},{"$f":"GALA!S13","v":4}]
[null,"Medley Relay"]
[6,"B 11/u 4 x 1L",{"$f":"GALA!D15","v":"-"},{"$f":"GALA!G15","v":1},{"$f":"GALA!J15","v":5},{"$f":"GALA!M15","v":4},{"$f":"GALA!P15","v":3},{"$f":"GALA!S15","v":2}]
[null,"Medley Relay"]
[7,"G 12/u 2L",{"$f":"GALA!D17","v":3},{"$f":"GALA!G17","v":4},{"$f":"GALA!J17","v":5},{"$f":"GALA!M17","v":2},{"$f":"GALA!P17","v":6},{"$f":"GALA!S17","v":1}]
[null,"Backstroke"]
[8,"B 12/u 2L ",{"$f":"GALA!D19","v":1},{"$f":"GALA!G19","v":3},{"$f":"GALA!J19","v":2},{"$f":"GALA!M19","v":6},{"$f":"GALA!P19","v":4},{"$f":"GALA!S19","v":5}]
[null,"Backstroke"]
[9,"G 10 yrs 2L",{"$f":"GALA!D21","v":1},{"$f":"GALA!G21","v":3},{"$f":"GALA!J21","v":2},{"$f":"GALA!M21","v":6},{"$f":"GALA!P21","v":5},{"$f":"GALA!S21","v":4}]
[null,"Breaststroke"]
[10,"B 10 yrs 2L",{"$f":"GALA!D23","v":6},{"$f":"GALA!G23","v":1},{"$f":"GALA!J23","v":2},{"$f":"GALA!M23","v":3},{"$f":"GALA!P23","v":4},{"$f":"GALA!S23","v":5}]
[null,"Breaststroke"]
[11,"G 9 yrs 4 x 1L",{"$f":"GALA!D25","v":2},{"$f":"GALA!G25","v":"-"},{"$f":"GALA!J25","v":"-"},{"$f":"GALA!M25","v":"-"},{"$f":"GALA!P25","v":3},{"$f":"GALA!S25","v":1}]
[null,"Mixed Stroke Relay"]
[12,"B 9 yrs 4 x lL",{"$f":"GALA!D27","v":3},{"$f":"GALA!G27","v":2},{"$f":"GALA!J27","v":"-"},{"$f":"GALA!M27","v":"-"},{"$f":"GALA!P27","v":4},{"$f":"GALA!S27","v":1}]
[null,"Mixed Stroke Relay"]
[13,"G 11/u 4 x lL",{"$f":"GALA!D29","v":3},{"$f":"GALA!G29","v":1},{"$f":"GALA!J29","v":4},{"$f":"GALA!M29","v":6},{"$f":"GALA!P29","v":2},{"$f":"GALA!S29","v":5}]
[null,"Freestyle Relay"]
[14,"B 11/u 4 x 1L",{"$f":"GALA!D31","v":6},{"$f":"GALA!G31","v":1},{"$f":"GALA!J31","v":3},{"$f":"GALA!M31","v":5},{"$f":"GALA!P31","v":2},{"$f":"GALA!S31","v":4}]
[null,"Freestyle Relay"]
[15,"G 12/u 2L",{"$f":"GALA!D33","v":6},{"$f":"GALA!G33","v":4},{"$f":"GALA!J33","v":3},{"$f":"GALA!M33","v":1},{"$f":"GALA!P33","v":5},{"$f":"GALA!S33","v":2}]
[null,"Butterfly"]
[16,"B 12/u 2L",{"$f":"GALA!D35","v":4},{"$f":"GALA!G35","v":5},{"$f":"GALA!J35","v":1},{"$f":"GALA!M35","v":2},{"$f":"GALA!P35","v":6},{"$f":"GALA!S35","v":3}]
[null," Butterfly"]
[17,"G 10/u 4 x1L",{"$f":"GALA!D37","v":3},{"$f":"GALA!G37","v":2},{"$f":"GALA!J37","v":1},{"$f":"GALA!M37","v":5},{"$f":"GALA!P37","v":"-"},{"$f":"GALA!S37","v":4}]
[null,"Medley Relay"]
[18,"B 10/u 4 x 1L",{"$f":"GALA!D39","v":"-"},{"$f":"GALA!G39","v":1},{"$f":"GALA!J39","v":2},{"$f":"GALA!M39","v":"-"},{"$f":"GALA!P39","v":3},{"$f":"GALA!S39","v":4}]
[null,"Medley Relay"]
[19,"G 11/u 2L",{"$f":"GALA!D41","v":5},{"$f":"GALA!G41","v":4},{"$f":"GALA!J41","v":2},{"$f":"GALA!M41","v":6},{"$f":"GALA!P41","v":1},{"$f":"GALA!S41","v":3}]
[null,"Backstroke"]
[20,"B 11/u 2L",{"$f":"GALA!D43","v":2},{"$f":"GALA!G43","v":1},{"$f":"GALA!J43","v":3},{"$f":"GALA!M43","v":6},{"$f":"GALA!P43","v":4},{"$f":"GALA!S43","v":5}]
[null,"Backstroke"]
[21,"G 9 yrs 4 x 1L",{"$f":"GALA!D45","v":4},{"$f":"GALA!G45","v":2},{"$f":"GALA!J45","v":3},{"$f":"GALA!M45","v":"-"},{"$f":"GALA!P45","v":5},{"$f":"GALA!S45","v":1}]
[null,"Freestyle Relay"]
[22,"B 9 yrs 4x1L",{"$f":"GALA!D47","v":"-"},{"$f":"GALA!G47","v":1},{"$f":"GALA!J47","v":"-"},{"$f":"GALA!M47","v":"-"},{"$f":"GALA!P47","v":3},{"$f":"GALA!S47","v":2}]
[null,"Freestyle Relay"]
[23,"G 12/u 2L ",{"$f":"GALA!D49","v":3},{"$f":"GALA!G49","v":2},{"$f":"GALA!J49","v":5},{"$f":"GALA!M49","v":1},{"$f":"GALA!P49","v":"-"},{"$f":"GALA!S49","v":4}]
[null,"Breaststroke"]
[24,"B 12/u 2L",{"$f":"GALA!D51","v":5},{"$f":"GALA!G51","v":2},{"$f":"GALA!J51","v":1},{"$f":"GALA!M51","v":6},{"$f":"GALA!P51","v":4},{"$f":"GALA!S51","v":3}]
[null,"Breaststroke"]
[25,"G 10yrs 4 x 1L",{"$f":"GALA!D53","v":2},{"$f":"GALA!G53","v":1},{"$f":"GALA!J53","v":4},{"$f":"GALA!M53","v":"-"},{"$f":"GALA!P53","v":5},{"$f":"GALA!S53","v":3}]
[null,"Freestyle Relay"]
[26,"B 10yrs 4 x 1L",{"$f":"GALA!D55","v":"-"},{"$f":"GALA!G55","v":2},{"$f":"GALA!J55","v":3},{"$f":"GALA!M55","v":"-"},{"$f":"GALA!P55","v":1},{"$f":"GALA!S55","v":4}]
[null,"Freestyle Relay"]
[27,"G 11/u 2L",{"$f":"GALA!D57","v":2},{"$f":"GALA!G57","v":4},{"$f":"GALA!J57","v":3},{"$f":"GALA!M57","v":"-"},{"$f":"GALA!P57","v":1},{"$f":"GALA!S57","v":"-"}]
[null,"Butterfly"]
[28,"B 11/u 2L",{"$f":"GALA!D59","v":5},{"$f":"GALA!G59","v":2},{"$f":"GALA!J59","v":6},{"$f":"GALA!M59","v":4},{"$f":"GALA!P59","v":1},{"$f":"GALA!S59","v":3}]
[null,"Butterfly"]
[29,"G 9 yrs 1L",{"$f":"GALA!D61","v":4},{"$f":"GALA!G61","v":1},{"$f":"GALA!J61","v":2},{"$f":"GALA!M61","v":6},{"$f":"GALA!P61","v":5},{"$f":"GALA!S61","v":3}]
[null,"Butterfly"]
[30,"B 9 yrs 1L",{"$f":"GALA!D63","v":4},{"$f":"GALA!G63","v":3},{"$f":"GALA!J63","v":"-"},{"$f":"GALA!M63","v":2},{"$f":"GALA!P63","v":"-"},{"$f":"GALA!S63","v":1}]
[null,"Butterfly"]
[31,"G 12/u 2L",{"$f":"GALA!D65","v":1},{"$f":"GALA!G65","v":3},{"$f":"GALA!J65","v":2},{"$f":"GALA!M65","v":6},{"$f":"GALA!P65","v":4},{"$f":"GALA!S65","v":5}]
[null,"Freestyle"]
[32,"B 12/u 2L",{"$f":"GALA!D67","v":5},{"$f":"GALA!G67","v":4},{"$f":"GALA!J67","v":6},{"$f":"GALA!M67","v":1},{"$f":"GALA!P67","v":2},{"$f":"GALA!S67","v":3}]
[null,"Freestyle"]
[33,"G 8 x 1L ",{"$f":"GALA!D69","v":"-"},{"$f":"GALA!G69","v":1},{"$f":"GALA!J69","v":"-"},{"$f":"GALA!M69","v":4},{"$f":"GALA!P69","v":3},{"$f":"GALA!S69","v":2}]
[null,"Freestyle Relay"]
[34,"B 10 yrs 2L",{"$f":"GALA!D71","v":5},{"$f":"GALA!G71","v":3},{"$f":"GALA!J71","v":1},{"$f":"GALA!M71","v":"-"},{"$f":"GALA!P71","v":2},{"$f":"GALA!S71","v":4}]
[null,"Backstroke"]
[35,"G 10 yrs 2L",{"$f":"GALA!D73","v":2},{"$f":"GALA!G73","v":1},{"$f":"GALA!J73","v":3},{"$f":"GALA!M73","v":5},{"$f":"GALA!P73","v":4},{"$f":"GALA!S73","v":"-"}]
[null,"Backstroke"]
[36,"B 9 yrs 1L",{"$f":"GALA!D75","v":3},{"$f":"GALA!G75","v":1},{"$f":"GALA!J75","v":5},{"$f":"GALA!M75","v":"-"},{"$f":"GALA!P75","v":4},{"$f":"GALA!S75","v":2}]
[null,"Freestyle"]
[37,"G 9 yrs 1L",{"$f":"GALA!D77","v":5},{"$f":"GALA!G77","v":2},{"$f":"GALA!J77","v":1},{"$f":"GALA!M77","v":6},{"$f":"GALA!P77","v":4},{"$f":"GALA!S77","v":3}]
[null,"Freestyle"]
[38,"B 12/u 4 x 1L",{"$f":"GALA!D79","v":6},{"$f":"GALA!G79","v":2},{"$f":"GALA!J79","v":1},{"$f":"GALA!M79","v":3},{"$f":"GALA!P79","v":4},{"$f":"GALA!S79","v":5}]
[null,"Freestyle Relay"]
[39,"G 12/u 4 x 1L",{"$f":"GALA!D81","v":"-"},{"$f":"GALA!G81","v":3},{"$f":"GALA!J81","v":2},{"$f":"GALA!M81","v":1},{"$f":"GALA!P81","v":5},{"$f":"GALA!S81","v":4}]
[null,"Freestyle Relay"]
[40,"B 11/u 2L",{"$f":"GALA!D83","v":3},{"$f":"GALA!G83","v":4},{"$f":"GALA!J83","v":6},{"$f":"GALA!M83","v":2},{"$f":"GALA!P83","v":5},{"$f":"GALA!S83","v":1}]
[null,"Breaststroke"]
[41,"G 11/u 2L",{"$f":"GALA!D85","v":5},{"$f":"GALA!G85","v":2},{"$f":"GALA!J85","v":3},{"$f":"GALA!M85","v":6},{"$f":"GALA!P85","v":4},{"$f":"GALA!S85","v":1}]
[null,"Breaststroke"]
[42,"B 8 x 1L ",{"$f":"GALA!D87","v":5},{"$f":"GALA!G87","v":1},{"$f":"GALA!J87","v":4},{"$f":"GALA!M87","v":"-"},{"$f":"GALA!P87","v":3},{"$f":"GALA!S87","v":2}]
[null,"Freestyle Relay"]
[43,"G 10 yrs 1L",{"$f":"GALA!D89","v":1},{"$f":"GALA!G89","v":3},{"$f":"GALA!J89","v":2},{"$f":"GALA!M89","v":5},{"$f":"GALA!P89","v":"-"},{"$f":"GALA!S89","v":4}]
[null,"Butterfly"]
[44,"B 10 yrs 1L ",{"$f":"GALA!D91","v":6},{"$f":"GALA!G91","v":5},{"$f":"GALA!J91","v":2},{"$f":"GALA!M91","v":1},{"$f":"GALA!P91","v":4},{"$f":"GALA!S91","v":3}]
[null,"Butterfly"]
[45,"G 9yrs 1L",{"$f":"GALA!D93","v":3},{"$f":"GALA!G93","v":5},{"$f":"GALA!J93","v":1},{"$f":"GALA!M93","v":"-"},{"$f":"GALA!P93","v":4},{"$f":"GALA!S93","v":2}]
[null,"Backstroke"]
[46,"B 9 yrs 1L ",{"$f":"GALA!D95","v":4},{"$f":"GALA!G95","v":2},{"$f":"GALA!J95","v":"-"},{"$f":"GALA!M95","v":"-"},{"$f":"GALA!P95","v":3},{"$f":"GALA!S95","v":1}]
[null,"Backstroke"]
[47,"G 11/u 2L ",{"$f":"GALA!D97","v":3},{"$f":"GALA!G97","v":2},{"$f":"GALA!J97","v":6},{"$f":"GALA!M97","v":5},{"$f":"GALA!P97","v":1},{"$f":"GALA!S97","v":4}]
[null,"Freestyle"]
[48,"B 11/u 2L ",{"$f":"GALA!D99","v":6},{"$f":"GALA!G99","v":1},{"$f":"GALA!J99","v":3},{"$f":"GALA!M99","v":5},{"$f":"GALA!P99","v":2},{"$f":"GALA!S99","v":4}]
[null,"Freestyle"]
[49,"G 12/u 4x1L ",{"$f":"GALA!D101","v":6},{"$f":"GALA!G101","v":5},{"$f":"GALA!J101","v":2},{"$f":"GALA!M101","v":1},{"$f":"GALA!P101","v":4},{"$f":"GALA!S101","v":3}]
[null,"Medley Relay"]
[50,"B 12/u 4x1L",{"$f":"GALA!D103","v":6},{"$f":"GALA!G103","v":2},{"$f":"GALA!J103","v":1},{"$f":"GALA!M103","v":3},{"$f":"GALA!P103","v":5},{"$f":"GALA!S103","v":4}]
[null,"Medley Relay"]
[51,"Mixed 8x1L Freestyle",{"$f":"GALA!D105","v":5},{"$f":"GALA!G105","v":1},{"$f":"GALA!J105","v":4},{"$f":"GALA!M105","v":2},{"$f":"GALA!P105","v":6},{"$f":"GALA!S105","v":3}]
[null,"Relay (1G+1B each"]
[null,"age group)"]
[null,"FIRSTS",{"$f":"COUNTIF(C4:C105,\"1\")","v":6},15,8,7,7,8]
[null,"SECONDS",{"$f":"COUNTIF(C4:C105,\"2\")","v":5},15,12,6,6,7]

{"sheet":"GIRLS","index":2,"n_rows":38,"n_cols":8,"rows_kept":38,"cut":false,"hidden":false,"merged":[]}
["No","Event","Lane 1 -","Lane 2 - ","Lane 3 - ","Lane 4 - ","Lane 5 - ","Lane 6 - "]
[]
[null,"Club Name",{"$f":"GALA!C4","v":""},{"$f":"GALA!F4","v":""},{"$f":"GALA!I4","v":""},{"$f":"GALA!L4","v":""},{"$f":"GALA!O4","v":""},{"$f":"GALA!R4","v":""}]
[3,"G 9yrs 1L ",{"$f":"GALA!C9","v":"Emilia Skelding"},{"$f":"GALA!F9","v":"Harriet Granahan"},{"$f":"GALA!I9","v":"Constance Gwillim"},{"$f":"GALA!L9","v":"00:00:00"},{"$f":"GALA!O9","v":"M Khera"},{"$f":"GALA!R9","v":"Abigail Bowater"}]
[null,"Breaststroke",{"$f":"GALA!C10","v":"00:00:24.670"},{"$f":"GALA!F10","v":"00:00:27.840"},{"$f":"GALA!I10","v":"00:00:26.480"},{"$f":"GALA!L10","v":"00:00:29.310"},{"$f":"GALA!O10","v":"00:00:27.560"},{"$f":"GALA!R10","v":"00:00:26.940"}]
[29,"G 9yrs 1L ",{"$f":"GALA!C61","v":"Emilia Skelding"},{"$f":"GALA!F61","v":"Esther McGeough"},{"$f":"GALA!I61","v":"Constance Gwillim"},{"$f":"GALA!L61","v":"00:00:00"},{"$f":"GALA!O61","v":"K Bell"},{"$f":"GALA!R61","v":"Evie-May Smith"}]
[null,"Butterfly",{"$f":"GALA!C62","v":"00:00:28.090"},{"$f":"GALA!F62","v":"00:00:23.460"},{"$f":"GALA!I62","v":"00:00:25.650"},{"$f":"GALA!L62","v":"00:00:36.370"},{"$f":"GALA!O62","v":"00:00:30.410"},{"$f":"GALA!R62","v":"00:00:27.130"}]
[35,"G 9 yrs 1L",{"$f":"GALA!C77","v":"Tiffany Latham"},{"$f":"GALA!F77","v":"Harriet Granahan"},{"$f":"GALA!I77","v":"Cassie Kelly-Cooper"},{"$f":"GALA!L77","v":"Lucy Talbot-Fielding"},{"$f":"GALA!O77","v":"M Munslow"},{"$f":"GALA!R77","v":"Abigail Bowater"}]
[null,"Freestyle",{"$f":"GALA!C78","v":"00:00:21.940"},{"$f":"GALA!F78","v":"00:00:20.090"},{"$f":"GALA!I78","v":"00:00:19.650"},{"$f":"GALA!L78","v":"00:00:26.190"},{"$f":"GALA!O78","v":"00:00:21.930"},{"$f":"GALA!R78","v":"00:00:21.440"}]
[43,"G 9 yrs 1L",{"$f":"GALA!C93","v":"Imogen Neal"},{"$f":"GALA!F93","v":"Esther McGeough"},{"$f":"GALA!I93","v":"Cassie Kelly-Cooper"},{"$f":"GALA!L93","v":"Ava Browne"},{"$f":"GALA!O93","v":"M Munslow"},{"$f":"GALA!R93","v":"Evie-May Smith"}]
[null,"Backstroke",{"$f":"GALA!C94","v":"00:00:24.400"},{"$f":"GALA!F94","v":"00:00:27.370"},{"$f":"GALA!I94","v":"00:00:24.200"},{"$f":"GALA!L94","v":"DQ"},{"$f":"GALA!O94","v":"00:00:25.340"},{"$f":"GALA!R94","v":"00:00:24.210"}]
[]
[1,"G 10yrs 2L ",{"$f":"GALA!C5","v":"Faith Shepherd"},{"$f":"GALA!F5","v":"Elouise Brookes"},{"$f":"GALA!I5","v":"Khloe Deoso"},{"$f":"GALA!L5","v":"Waleeha Qaiser"},{"$f":"GALA!O5","v":"S Warrilow"},{"$f":"GALA!R5","v":"Scarlett Fletcher"}]
[null,"Freestyle",{"$f":"GALA!C6","v":"00:00:36.370"},{"$f":"GALA!F6","v":"00:00:37.020"},{"$f":"GALA!I6","v":"00:00:37.280"},{"$f":"GALA!L6","v":"00:01:00.970"},{"$f":"GALA!O6","v":"00:01:20.370"},{"$f":"GALA!R6","v":"00:00:39.500"}]
[9,"G 10 yrs 2L",{"$f":"GALA!C21","v":"Amber Valletta"},{"$f":"GALA!F21","v":"Izzie Wilkinson"},{"$f":"GALA!I21","v":"Ayla Goucher"},{"$f":"GALA!L21","v":"Neveah Choudhury"},{"$f":"GALA!O21","v":"M Khera"},{"$f":"GALA!R21","v":"Scarlett Fletcher"}]
[null,"Breaststroke",{"$f":"GALA!C22","v":"00:00:49.470"},{"$f":"GALA!F22","v":"00:00:55.080"},{"$f":"GALA!I22","v":"00:00:53.330"},{"$f":"GALA!L22","v":"00:01:03.440"},{"$f":"GALA!O22","v":"00:01:02.160"},{"$f":"GALA!R22","v":"00:00:55.720"}]
[33,"G 10 yrs 2L",{"$f":"GALA!C73","v":"Amber Valletta"},{"$f":"GALA!F73","v":"Elloiuse Brookes"},{"$f":"GALA!I73","v":"Louise Khrone"},{"$f":"GALA!L73","v":"Neveah Choudhury"},{"$f":"GALA!O73","v":"S Warrilow"},{"$f":"GALA!R73","v":"Lacey Small"}]
[null,"Backstroke",{"$f":"GALA!C74","v":"00:00:46.630"},{"$f":"GALA!F74","v":"00:00:44.980"},{"$f":"GALA!I74","v":"00:00:47.480"},{"$f":"GALA!L74","v":"00:01:03.020"},{"$f":"GALA!O74","v":"00:01:00.500"},{"$f":"GALA!R74","v":"DQ"}]
[41,"G 10 yrs 1L",{"$f":"GALA!C89","v":"Faith Shepherd"},{"$f":"GALA!F89","v":"Hannah Johnson"},{"$f":"GALA!I89","v":"Ayla Goucher"},{"$f":"GALA!L89","v":"Kiyane Mesref"},{"$f":"GALA!O89","v":"00:00:00"},{"$f":"GALA!R89","v":"Amelie Hemmingway"}]
[null,"Butterfly",{"$f":"GALA!C90","v":"00:00:19.030"},{"$f":"GALA!F90","v":"00:00:23.330"},{"$f":"GALA!I90","v":"00:00:20.990"},{"$f":"GALA!L90","v":"00:00:42.120"},{"$f":"GALA!O90","v":"DNS"},{"$f":"GALA!R90","v":"00:00:25.650"}]
[]
[19,"G 11/u 2L",{"$f":"GALA!C41","v":"Isobelle Carpenter-Clay"},{"$f":"GALA!F41","v":"Molly Kirkland"},{"$f":"GALA!I41","v":"Eleanor Ribchester"},{"$f":"GALA!L41","v":"Indigo Perrett"},{"$f":"GALA!O41","v":"R Powell"},{"$f":"GALA!R41","v":"Eva Browne"}]
[null,"Backstroke",{"$f":"GALA!C42","v":"00:00:46.120"},{"$f":"GALA!F42","v":"00:00:45.830"},{"$f":"GALA!I42","v":"00:00:44.820"},{"$f":"GALA!L42","v":"00:00:53.870"},{"$f":"GALA!O42","v":"00:00:43.630"},{"$f":"GALA!R42","v":"00:00:45.090"}]
[27,"G 11/u 2L",{"$f":"GALA!C57","v":"Isobelle Carpenter-Clay"},{"$f":"GALA!F57","v":"Sarah Hunt"},{"$f":"GALA!I57","v":"Eleanor Ribchester"},{"$f":"GALA!L57","v":""},{"$f":"GALA!O57","v":"E Hendon"},{"$f":"GALA!R57","v":"00:00:00"}]
[null,"Butterfly",{"$f":"GALA!C58","v":"00:00:48.470"},{"$f":"GALA!F58","v":"00:00:53.940"},{"$f":"GALA!I58","v":"00:00:50.170"},{"$f":"GALA!L58","v":"DNS"},{"$f":"GALA!O58","v":"00:00:46.750"},{"$f":"GALA!R58","v":"DNS"}]
[39,"G 11/u 2L",{"$f":"GALA!C85","v":"Lilly Neal"},{"$f":"GALA!F85","v":"Sarah Hunt"},{"$f":"GALA!I85","v":"Megan O'Reilly"},{"$f":"GALA!L85","v":"Neveah Choudhury"},{"$f":"GALA!O85","v":"A Ingram"},{"$f":"GALA!R85","v":"Eva Browne"}]
[null,"Breaststroke",{"$f":"GALA!C86","v":"00:00:53.930"},{"$f":"GALA!F86","v":"00:00:51.810"},{"$f":"GALA!I86","v":"00:00:51.880"},{"$f":"GALA!L86","v":"00:01:04.870"},{"$f":"GALA!O86","v":"00:00:53.310"},{"$f":"GALA!R86","v":"00:00:49.310"}]
[45,"G 11/u 2L ",{"$f":"GALA!C97","v":"Gracie Bull"},{"$f":"GALA!F97","v":"Molly Kirkland"},{"$f":"GALA!I97","v":"Cara Miller"},{"$f":"GALA!L97","v":"Indigo Perrett"},{"$f":"GALA!O97","v":"R Powell"},{"$f":"GALA!R97","v":"Hannah Norton"}]
[null,"Freestyle",{"$f":"GALA!C98","v":"00:00:41.460"},{"$f":"GALA!F98","v":"00:00:38.010"},{"$f":"GALA!I98","v":"00:00:50.460"},{"$f":"GALA!L98","v":"00:00:49.130"},{"$f":"GALA!O98","v":"00:00:37.850"},{"$f":"GALA!R98","v":"00:00:49"}]
[]
[7,"G 12/u 2L",{"$f":"GALA!C17","v":"Jessica Adcock"},{"$f":"GALA!F17","v":"Ellie Chater"},{"$f":"GALA!I17","v":"Erin Irving"},{"$f":"GALA!L17","v":"AJ Finch"},{"$f":"GALA!O17","v":"R Powell"},{"$f":"GALA!R17","v":"Esther Cunniffe"}]
[null,"Backstroke",{"$f":"GALA!C18","v":"00:00:41.150"},{"$f":"GALA!F18","v":"00:00:41.720"},{"$f":"GALA!I18","v":"00:00:42.300"},{"$f":"GALA!L18","v":"00:00:39.880"},{"$f":"GALA!O18","v":"00:00:44.910"},{"$f":"GALA!R18","v":"00:00:39.190"}]
[15,"G 12/u 2L",{"$f":"GALA!C33","v":"Amber Valletta"},{"$f":"GALA!F33","v":"Emily Withey"},{"$f":"GALA!I33","v":"Molly Faber"},{"$f":"GALA!L33","v":"Charlotte Inshaw"},{"$f":"GALA!O33","v":"A Robathan"},{"$f":"GALA!R33","v":"Esther Cunniffe"}]
[null,"Butterfly",{"$f":"GALA!C34","v":"00:00:47.600"},{"$f":"GALA!F34","v":"00:00:46.300"},{"$f":"GALA!I34","v":"00:00:46.130"},{"$f":"GALA!L34","v":"00:00:33.750"},{"$f":"GALA!O34","v":"00:00:47.590"},{"$f":"GALA!R34","v":"00:00:37.720"}]
[23,"G 12/u 2L ",{"$f":"GALA!C49","v":"Libby Wilks"},{"$f":"GALA!F49","v":"Emily Withey"},{"$f":"GALA!I49","v":"Eve Phillips"},{"$f":"GALA!L49","v":"Abigail Tan"},{"$f":"GALA!O49","v":"E Rollins"},{"$f":"GALA!R49","v":"Olivia Samuels"}]
[null,"Breaststroke",{"$f":"GALA!C50","v":"00:00:48.440"},{"$f":"GALA!F50","v":"00:00:47.380"},{"$f":"GALA!I50","v":"00:00:51.950"},{"$f":"GALA!L50","v":"00:00:39.310"},{"$f":"GALA!O50","v":"DQ"},{"$f":"GALA!R50","v":"00:00:50.440"}]
[29,"G 12/u 2L",{"$f":"GALA!C61","v":"Emilia Skelding"},{"$f":"GALA!F61","v":"Esther McGeough"},{"$f":"GALA!I61","v":"Constance Gwillim"},{"$f":"GALA!L61","v":"00:00:00"},{"$f":"GALA!O61","v":"K Bell"},{"$f":"GALA!R61","v":"Evie-May Smith"}]
[null,"Freestyle",{"$f":"GALA!C62","v":"00:00:28.090"},{"$f":"GALA!F62","v":"00:00:23.460"},{"$f":"GALA!C62","v":"00:00:28.090"},{"$f":"GALA!L62","v":"00:00:36.370"},{"$f":"GALA!O62","v":"00:00:30.410"},{"$f":"GALA!R62","v":"00:00:27.130"}]

{"sheet":"BOYS","index":3,"n_rows":38,"n_cols":8,"rows_kept":38,"cut":false,"hidden":false,"merged":[]}
["No","Event"]
[null,null,"Lane 1 -","Lane 2 - ","Lane 3 - ","Lane 4 - ","Lane 5 - ","Lane 6 - "]
[null,"Club Name",{"$f":"GALA!C4","v":""},{"$f":"GALA!F4","v":""},{"$f":"GALA!I4","v":""},{"$f":"GALA!L4","v":""},{"$f":"GALA!O4","v":""},{"$f":"GALA!R4","v":""}]
[4,"B 9 yrs 1L ",{"$f":"GALA!C11","v":"Christian Neal"},{"$f":"GALA!F11","v":"Harry Chruchley"},{"$f":"GALA!I11","v":"Ethan Ryan"},{"$f":"GALA!L11","v":"James Inshaw"},{"$f":"GALA!O11","v":"J Watson"},{"$f":"GALA!R11","v":"Leo Gamage"}]
[null,"Breaststroke",{"$f":"GALA!C12","v":"00:00:31.680"},{"$f":"GALA!F12","v":"00:00:28.760"},{"$f":"GALA!I12","v":"DQ"},{"$f":"GALA!L12","v":"00:00:23.190"},{"$f":"GALA!O12","v":"00:00:25.690"},{"$f":"GALA!R12","v":"00:00:28.460"}]
[30,"B 9 yrs 1L ",{"$f":"GALA!C63","v":"Adam Walker"},{"$f":"GALA!F63","v":"Oliver Jennings"},{"$f":"GALA!I63","v":""},{"$f":"GALA!L63","v":"James Inshaw"},{"$f":"GALA!O63","v":""},{"$f":"GALA!R63","v":"Willem Cunniffe"}]
[null,"Butterfly",{"$f":"GALA!C64","v":"00:00:30.900"},{"$f":"GALA!F64","v":"00:00:22.630"},{"$f":"GALA!I64","v":"DNS"},{"$f":"GALA!L64","v":"00:00:21.250"},{"$f":"GALA!O64","v":"DNS"},{"$f":"GALA!R64","v":"00:00:19.810"}]
[34,"B 9 yrs 1L ",{"$f":"GALA!C75","v":"Adam Walker"},{"$f":"GALA!F75","v":"Oliver Jennings"},{"$f":"GALA!I75","v":"Ethan Ryan"},{"$f":"GALA!L75","v":"00:00:00"},{"$f":"GALA!O75","v":"J Watson"},{"$f":"GALA!R75","v":"Willem Cunniffe"}]
[null,"Freestyle",{"$f":"GALA!C76","v":"00:00:20.410"},{"$f":"GALA!F76","v":"00:00:17.320"},{"$f":"GALA!I76","v":"00:00:32.460"},{"$f":"GALA!L76","v":"DNS"},{"$f":"GALA!O76","v":"00:00:22.030"},{"$f":"GALA!R76","v":"00:00:18.370"}]
[44,"B 9 yrs 1L ",{"$f":"GALA!C95","v":"Oscar Yates"},{"$f":"GALA!F95","v":"Callum Anderson"},{"$f":"GALA!I95","v":""},{"$f":"GALA!L95","v":"Luka Prodan"},{"$f":"GALA!O95","v":"N Kalitat"},{"$f":"GALA!R95","v":"Finley Cowdell"}]
[null,"Backstroke",{"$f":"GALA!C96","v":"00:00:29.470"},{"$f":"GALA!F96","v":"00:00:27.060"},{"$f":"GALA!I96","v":"DNS"},{"$f":"GALA!L96","v":"DNS"},{"$f":"GALA!O96","v":"00:00:27.470"},{"$f":"GALA!R96","v":"00:00:24.050"}]
[]
[2,"B 10 yrs 2L ",{"$f":"GALA!C7","v":"Zac Matthews"},{"$f":"GALA!F8","v":"00:00:42.150"},{"$f":"GALA!I7","v":"Toru Ashton"},{"$f":"GALA!L7","v":"Veer Mulji"},{"$f":"GALA!O7","v":"00:00:00"},{"$f":"GALA!R7","v":"Archie Hudson"}]
[null,"Freestyle",{"$f":"GALA!C8","v":"DQ"},{"$f":"GALA!#REF!","v":{"$error":"#REF!"}},{"$f":"GALA!I8","v":"00:00:41.220"},{"$f":"GALA!L8","v":"00:00:40.750"},{"$f":"GALA!O8","v":"00:00:38.500"},{"$f":"GALA!R8","v":"00:00:44.400"}]
[10,"B 10 yrs 2L ",{"$f":"GALA!C23","v":"Adam Walker"},{"$f":"GALA!F23","v":"Charlie Hodgetts"},{"$f":"GALA!I23","v":"Keiran O'Reilly"},{"$f":"GALA!L23","v":"Joe Box"},{"$f":"GALA!O23","v":"W Bottrill"},{"$f":"GALA!R23","v":"Musa Yusopov"}]
[null,"Breaststroke",{"$f":"GALA!C24","v":"00:00:58.590"},{"$f":"GALA!F24","v":"00:00:46.710"},{"$f":"GALA!I24","v":"00:00:49.070"},{"$f":"GALA!L24","v":"00:00:49.370"},{"$f":"GALA!O24","v":"00:00:53.880"},{"$f":"GALA!R24","v":"00:00:58.570"}]
[32,"B 10 yrs 2L ",{"$f":"GALA!C71","v":"Riley Binks"},{"$f":"GALA!F71","v":"Christian Morgan"},{"$f":"GALA!I71","v":"Luke Burton"},{"$f":"GALA!L71","v":"Veer Mulji"},{"$f":"GALA!O71","v":"T Mobbs"},{"$f":"GALA!R71","v":"Musa Yusopov"}]
[null,"Backstroke",{"$f":"GALA!C72","v":"00:00:54.510"},{"$f":"GALA!F72","v":"00:00:46.960"},{"$f":"GALA!I72","v":"00:00:45.630"},{"$f":"GALA!L72","v":"DQ"},{"$f":"GALA!O72","v":"00:00:45.640"},{"$f":"GALA!R72","v":"00:00:53.060"}]
[42,"B 10 yrs 1L ",{"$f":"GALA!C91","v":"Christian Neal"},{"$f":"GALA!F91","v":"Christian Morgan"},{"$f":"GALA!I91","v":"Kieran O'Reilly"},{"$f":"GALA!L91","v":"Joe Box"},{"$f":"GALA!O91","v":"T Mobbs"},{"$f":"GALA!R91","v":"Willem Cunniffe"}]
[null,"Butterfly",{"$f":"GALA!C92","v":"00:00:31.490"},{"$f":"GALA!F92","v":"00:00:23.890"},{"$f":"GALA!I92","v":"00:00:19.370"},{"$f":"GALA!L92","v":"00:00:17.500"},{"$f":"GALA!O92","v":"00:00:21.910"},{"$f":"GALA!R92","v":"00:00:19.440"}]
[]
[20,"B 11/u 2L",{"$f":"GALA!C43","v":"Alex Walker"},{"$f":"GALA!F43","v":"Reece Johnson"},{"$f":"GALA!I43","v":"Thomas Ribchester"},{"$f":"GALA!L43","v":"Riley Talbot-Fielding"},{"$f":"GALA!O43","v":"H Bottrill"},{"$f":"GALA!R43","v":"Matthew Bowater"}]
[null,"Backstroke",{"$f":"GALA!C44","v":"00:00:40.900"},{"$f":"GALA!F44","v":"00:00:37.810"},{"$f":"GALA!I44","v":"00:00:44.310"},{"$f":"GALA!L44","v":"00:00:53.560"},{"$f":"GALA!O44","v":"00:00:45.530"},{"$f":"GALA!R44","v":"00:00:46.580"}]
[28,"B 11/u 2L",{"$f":"GALA!C59","v":"Alex Walker"},{"$f":"GALA!F59","v":"Reece Johnson"},{"$f":"GALA!I59","v":"Sonny Butcher"},{"$f":"GALA!L59","v":"Issac Walton"},{"$f":"GALA!O59","v":"B Webb"},{"$f":"GALA!R59","v":"Tom Lucas"}]
[null,"Butterfly",{"$f":"GALA!C60","v":"00:00:45.370"},{"$f":"GALA!F60","v":"00:00:41.290"},{"$f":"GALA!I60","v":"00:00:51.200"},{"$f":"GALA!L60","v":"00:00:43.190"},{"$f":"GALA!O60","v":"00:00:38.720"},{"$f":"GALA!R60","v":"00:00:42.900"}]
[38,"B 11/u 2L",{"$f":"GALA!C83","v":"Lachlin Woodend"},{"$f":"GALA!F83","v":"Sam Withey"},{"$f":"GALA!I83","v":"Sonny Butcher"},{"$f":"GALA!L83","v":"Issac Walton"},{"$f":"GALA!O83","v":"A Guild"},{"$f":"GALA!R83","v":"Harvie Lal"}]
[null,"Breaststroke",{"$f":"GALA!C84","v":"00:00:48.700"},{"$f":"GALA!F84","v":"00:00:49.460"},{"$f":"GALA!I84","v":"00:00:55.220"},{"$f":"GALA!L84","v":"00:00:48.560"},{"$f":"GALA!O84","v":"00:00:52.250"},{"$f":"GALA!R84","v":"00:00:46.250"}]
[46,"B 11/u 2L ",{"$f":"GALA!C99","v":"Lachlin Woodend"},{"$f":"GALA!F99","v":"Sam Withey"},{"$f":"GALA!I99","v":"Thomas Ribchester"},{"$f":"GALA!L99","v":"Riley Talbot-Fielding"},{"$f":"GALA!O99","v":"B Webb"},{"$f":"GALA!R99","v":"Tom Lucas"}]
[null,"Freestyle",{"$f":"GALA!C100","v":"00:00:40.020"},{"$f":"GALA!F100","v":"00:00:33"},{"$f":"GALA!I100","v":"00:00:36.720"},{"$f":"GALA!L100","v":"00:00:39.750"},{"$f":"GALA!O100","v":"00:00:33.500"},{"$f":"GALA!R100","v":"00:00:37.580"}]
[]
[8,"B 12/u 2L ",{"$f":"GALA!C19","v":"Alex Walker"},{"$f":"GALA!F19","v":"Sam Nicholson"},{"$f":"GALA!I19","v":"Thomas Collerhan"},{"$f":"GALA!L19","v":"Michael Bushael"},{"$f":"GALA!O19","v":"H Bottrill"},{"$f":"GALA!R19","v":"Adam Whitehouse"}]
[null,"Backstroke",{"$f":"GALA!C20","v":"00:00:39.540"},{"$f":"GALA!F20","v":"00:00:43.380"},{"$f":"GALA!I20","v":"00:00:40.650"},{"$f":"GALA!L20","v":"00:00:47.250"},{"$f":"GALA!O20","v":"00:00:44.380"},{"$f":"GALA!R20","v":"00:00:45.810"}]
[16,"B 12/u 2L",{"$f":"GALA!C35","v":"Solomon Mansfield"},{"$f":"GALA!F35","v":"Harvey Ashead"},{"$f":"GALA!I35","v":"Dylan Abulencia"},{"$f":"GALA!L35","v":"Alfiie Cowie"},{"$f":"GALA!O35","v":"C Fletcher"},{"$f":"GALA!R35","v":"Luca Whaley"}]
[null," Butterfly",{"$f":"GALA!C36","v":"00:00:43.840"},{"$f":"GALA!F36","v":"00:00:44.460"},{"$f":"GALA!I36","v":"00:00:35.350"},{"$f":"GALA!L36","v":"00:00:36.380"},{"$f":"GALA!O36","v":"00:00:46.100"},{"$f":"GALA!R36","v":"00:00:38.590"}]
[24,"B 12/u 2L",{"$f":"GALA!C51","v":"Lachlin Woodend"},{"$f":"GALA!F51","v":"Harvey Ashead"},{"$f":"GALA!I51","v":"Dylan Abulencia"},{"$f":"GALA!L51","v":"Michael Dutton"},{"$f":"GALA!O51","v":"C Fletcher"},{"$f":"GALA!R51","v":"Harvie Lal"}]
[null,"Breaststroke",{"$f":"GALA!C52","v":"00:00:50.040"},{"$f":"GALA!F52","v":"00:00:43.610"},{"$f":"GALA!I52","v":"00:00:40.240"},{"$f":"GALA!L52","v":"00:00:55.120"},{"$f":"GALA!O52","v":"00:00:49.940"},{"$f":"GALA!R52","v":"00:00:46.190"}]
[30,"B 12/u 2L",{"$f":"GALA!C67","v":"Solomon Mansfield"},{"$f":"GALA!F67","v":"Sam Nicholson"},{"$f":"GALA!I67","v":"Aiden Irving"},{"$f":"GALA!L67","v":"Alfiie Cowie"},{"$f":"GALA!O67","v":"B Webb"},{"$f":"GALA!R67","v":"Luca Whaley"}]
[null,"Freestyle",{"$f":"GALA!C68","v":"00:00:35.430"},{"$f":"GALA!F68","v":"00:00:35.080"},{"$f":"GALA!I68","v":"00:00:35.440"},{"$f":"GALA!L68","v":"00:00:32.500"},{"$f":"GALA!O68","v":"00:00:33.290"},{"$f":"GALA!R68","v":"00:00:34.560"}]

{"sheet":"Lane 1","index":4,"n_rows":104,"n_cols":7,"rows_kept":104,"cut":false,"hidden":false,"merged":[]}
[null,"Club Name"]
[null,"Lane No: 1"]
[1,"G 10yrs 2L ","Scarlett Fletcher"]
[null,"Freestyle"]
[2,"B 10/u 2L ","Archie Hudson"]
[null,"Freestyle"]
[3,"G 9 yrs 1L","Abigail Bowater"]
[null,"Breaststroke"]
[4,"B 9 yrs 1L","Leo Gamage"]
[null,"Breaststroke"]
[5,"G 11/u 4 x 1L ","Relay","Hannah Norton","Eva Browne","Scarlett Fletcher","Libby-Jo Edwards"]
[null,"Medley Relay"]
[6,"B 11/u 4 x 1L","Relay","Matthew Bowater","Harvie Lal","Tom Lucas","Harry Lange"]
[null,"Medley Relay"]
[7,"G 12/u 2L","Esther Cunniffe"]
[null,"Backstroke"]
[8,"B 12/u 2L ","Adam Whitehouse"]
[null,"Backstroke"]
[9,"G 10/u 2L","Scarlett Fletcher"]
[null,"Breaststroke"]
[10,"B 10/u 2L","Musa Yusopov"]
[null,"Breaststroke"]
[11,"G 9 yrs 4 x 1L","Relay","Abigail Bowater","Evie-May Smith","Amelie Hemmingway","Michaela Farrell"]
[null,"Medley Relay"]
[12,"B 9 yrs 4 x lL","Relay","Willem Cunniffe","Leo Gamage","Finley Cowdell","Benjamin Walker"]
[null,"Medley Relay"]
[13,"G 11/u 4 x lL","Relay","Eva Browne","Libby-Jo Edwards","Jessica Key","Hannah Norton"]
[null,"Freestyle Relay"]
[14,"B 11/u 4 x 1L","Relay","Tom Lucas","Harvie Lal","Matthew Bowater","Harry Lange"]
[null,"Freestyle Relay"]
[15,"G 12/u 2L","Esther Cunniffe"]
[null,"Butterfly"]
[16,"B 12/u 2L","Luca Whaley"]
[null," Butterfly"]
[17,"G 10/u 4 x1L","Relay","Amelie Hemmingway","Lacey Small","Evie-May Smith","Scarlett Fletcher"]
[null,"Medley Relay"]
[18,"B 10/u 4 x 1L","Relay","Willem Cunniffe","Musa Yusopov","Finley Cowdell","Archie Hudson"]
[null,"Medley Relay"]
[19,"G 11/u 2L","Eva Browne"]
[null,"Backstroke"]
[20,"B 11/u 2L","Matthew Bowater"]
[null,"Backstroke"]
[21,"G 9 yrs 4 x 1L","Relay","Evie-May Smith","Michaela Farrell","Amelie Hemmingway","Abigail Bowater"]
[null,"Freestyle Relay"]
[22,"B 9 yrs 4x1L","Relay","Willem Cunniffe","Benjamin Walker","Finley Cowdell","Leo Gamage"]
[null,"Freestyle Relay"]
[23,"G 12/u 2L ","Olivia Samuels"]
[null,"Breaststroke"]
[24,"B 12/u 2L","Harvie Lal"]
[null,"Breaststroke"]
[25,"G 10yrs 4 x 1L","Relay","Scarlett Fletcher","Lacey Small","Jessica Key","Michaela Farrell"]
[null,"Freestyle Relay"]
[26,"B 10yrs 4 x 1L","Relay","Leo Gamage","Benjamin Walker","Musa Yusopov","Archie Hudson"]
[null,"Freestyle Relay"]
[27,"G 11/u 2L"]
[null,"Butterfly"]
[28,"B 11/u 2L","Tom Lucas"]
[null,"Butterfly"]
[29,"G 9 yrs 1L","Evie-May Smith"]
[null,"Butterfly"]
[30,"B 9 yrs 1L","Willem Cunniffe"]
[null,"Butterfly"]
[31,"G 12/u 2L","Sarah Tavares"]
[null,"Freestyle"]
[32,"B 12/u 2L","Luca Whaley"]
[null,"Freestyle"]
[33,"G 8 x 1L ","Relay","Abigail Bowater","Evie-May Smith","Amelie Hemmingway","Scarlett Fletcher"]
[null,"Freestyle Relay",null,"Libby-Jo Edwards","Eva Browne","Sarah Tavares","Esther Cunniffe"]
[34,"B 10/u 2L","Musa Yusopov"]
[null,"Backstroke"]
[35,"G 10/u 2L","Lacey Small"]
[null,"Backstroke"]
[36,"B 9 yrs 1L","Willem Cunniffe"]
[null,"Freestyle"]
[37,"G 9 yrs 1L","Abigail Bowater"]
[null,"Freestyle"]
[38,"B 12/u 4 x 1L","Relay","Tom Lucas","Adam Whitehouse","Imron Yusopov","Luca Whaley"]
[null,"Freestyle Relay"]
[39,"G 12/u 4 x 1L","Relay","Sarah Tavares","Eva Browne","Esther Cunniffe","Olivia Samuels"]
[null,"Freestyle Relay"]
[40,"B 11/u 2L","Harvie Lal"]
[null,"Breaststroke"]
[41,"G 11/u 2L","Eva Browne"]
[null,"Breaststroke"]
[42,"B 8 x 1L ","Relay","Finley Cowdell","Willem Cunniffe","Leo Gamage","Archie Hudson"]
[null,"Freestyle Relay",null,"Harvie Lal","Harry Lange","Tom Lucas","Luca Whaley"]
[43,"G 10/u 1L","Amelie Hemmingway"]
[null,"Butterfly"]
[44,"B 10/u 1L ","Willem Cunniffe"]
[null,"Butterfly"]
[45,"G 9yrs 1L","Evie-May Smith"]
[null,"Backstroke"]
[46,"B 9 yrs 1L ","Finley Cowdell"]
[null,"Backstroke"]
[47,"G 11/u 2L ","Hannah Norton"]
[null,"Freestyle"]
[48,"B 11/u 2L ","Tom Lucas"]
[null,"Freestyle"]
[49,"G 12/u 4x1L ","Relay","Eva Browne","Sarah Tavares","Esther Cunniffe","Olivia Samuels"]
[null,"Medley Relay"]
[50,"B 12/u 4x1L","Relay","Matthew Bowater","Harvie Lal","Luca Whaley","Imron Yusupov"]
[null,"Medley Relay"]
[51,"Mixed 8x1L Freestyle","Relay","Amelie Hemmingway","Benjamin Walker","Lacey Small","Musa Yusopov"]
[null,"Relay (1G+1B each age group)",null,"Hannah Norton","Adam Whitehouse","Esther Cunniffe","Luca Whaley"]

{"sheet":"Lane 2","index":5,"n_rows":104,"n_cols":7,"rows_kept":104,"cut":false,"hidden":false,"merged":[]}
[null,"Club Name"]
[null,"Lane No:"]
[1,"G 10yrs 2L ","Faith Shepherd"]
[null,"Freestyle"]
[2,"B 10/u 2L ","Zac Matthews"]
[null,"Freestyle"]
[3,"G 9 yrs 1L","Emilia Skelding"]
[null,"Breaststroke"]
[4,"B 9 yrs 1L","Christian Neal"]
[null,"Breaststroke"]
[5,"G 11/u 4 x 1L ","Relay","Ruby Wollaston","Zara Merrick"]
[null,"Medley Relay",null,"Isabelle Carpenter-Clay","Gracie Bull"]
[6,"B 11/u 4 x 1L","Relay","Cleeve Poxon","Lochlan Woodend"]
[null,"Medley Relay",null,"Alex Walker","Ismail Ali"]
[7,"G 12/u 2L","Jessica Adcock"]
[null,"Backstroke"]
[8,"B 12/u 2L ","Alex Walker"]
[null,"Backstroke"]
[9,"G 10/u 2L","Amber Valletta"]
[null,"Breaststroke"]
[10,"B 10/u 2L","Adam Walker"]
[null,"Breaststroke"]
[11,"G 9 yrs 4 x 1L","Relay","Demi Hood","Natalie Holiday"]
[null,"Medley Relay",null,"Emilia Skelding","Tamar Davis"]
[12,"B 9 yrs 4 x lL","Relay","Oscar Yates","Christian Neal"]
[null,"Medley Relay",null,"Adam Walker","Riley Binks"]
[13,"G 11/u 4 x lL",null,"Gracie Bull","Lily Neal"]
[null,"Freestyle Relay","Relay","Zara Merrick","Ruby Woolaston"]
[14,"B 11/u 4 x 1L",null,"Alex Walker","Cleeve Poxon"]
[null,"Freestyle Relay","Relay","Lachlin Woodend","Zac Matthews"]
[15,"G 12/u 2L","Amber Valletta"]
[null,"Butterfly"]
[16,"B 12/u 2L","Solomon Mansfield"]
[null," Butterfly"]
[17,"G 10/u 4 x1L","Relay","Imogen Neal","Amber Valletta"]
[null,"Medley Relay",null,"Faith Shepherd","Tiffany Latham"]
[18,"B 10/u 4 x 1L","Relay","Riley Binks","Zac Matthews"]
[null,"Medley Relay",null,"Adam Walker","Christian Neal"]
[19,"G 11/u 2L","Isobelle Carpenter-Clay"]
[null,"Backstroke"]
[20,"B 11/u 2L","Alex Walker"]
[null,"Backstroke"]
[21,"G 9 yrs 4 x 1L","Relay","Imogen Neal","Leah Harris"]
[null,"Freestyle Relay",null,"Demi Hood","Tiffany Latham"]
[22,"B 9 yrs 4x1L","Relay","Adam Walker","Christian Neal"]
[null,"Freestyle Relay",null,"Oscar Yates","Riley Binks"]
[23,"G 12/u 2L ","Libby Wilks"]
[null,"Breaststroke"]
[24,"B 12/u 2L","Lachlin Woodend"]
[null,"Breaststroke"]
[25,"G 10yrs 4 x 1L","Relay","Faith Shepherd","Emily Skelding"]
[null,"Freestyle Relay",null,"Natalie Holiday","Amber Valletta"]
[26,"B 10yrs 4 x 1L","Relay","Riley Binks","Zac Matthews"]
[null,"Freestyle Relay",null,"Oscar Yates","Christian Neal"]
[27,"G 11/u 2L","Isobelle Carpenter-Clay"]
[null,"Butterfly"]
[28,"B 11/u 2L","Alex Walker"]
[null,"Butterfly"]
[29,"G 9 yrs 1L","Emilia Skelding"]
[null,"Butterfly"]
[30,"B 9 yrs 1L","Adam Walker"]
[null,"Butterfly"]
[31,"G 12/u 2L","Libby Wilks"]
[null,"Freestyle"]
[32,"B 12/u 2L","Solomon Mansfield"]
[null,"Freestyle"]
[33,"G 8 x 1L ","Relay","Tamar Davis","Emily Skelding","Lilly Neal","Jessica Adcock"]
[null,"Freestyle Relay",null,"Leah Harris","Faith Shepherd","Ruby Woolaston","Libbie Wilks"]
[34,"B 10/u 2L","Riley Binks"]
[null,"Backstroke"]
[35,"G 10/u 2L","Amber Valletta"]
[null,"Backstroke"]
[36,"B 9 yrs 1L","Adam Walker"]
[null,"Freestyle"]
[37,"G 9 yrs 1L","Tiffany Latham"]
[null,"Freestyle"]
[38,"B 12/u 4 x 1L","Relay","Alex Walker","Lachlin Woodend"]
[null,"Freestyle Relay",null,"Rehan Ali","Solomon Mansfield"]
[39,"G 12/u 4 x 1L","Relay","Libbie Wilks","Gracie Bull"]
[null,"Freestyle Relay",null,"Zara Merrick","Jessica Adcock"]
[40,"B 11/u 2L","Lachlin Woodend"]
[null,"Breaststroke"]
[41,"G 11/u 2L","Lilly Neal"]
[null,"Breaststroke"]
[42,"B 8 x 1L ","Relay","Christian Neal","Riley Binks","Cleeve Poxon","Alex Walker"]
[null,"Freestyle Relay",null,"Oscar Yates","Zac Matthews","Lachlin Woodend","Solomon Mansfield"]
[43,"G 10/u 1L","Faith Shepherd"]
[null,"Butterfly"]
[44,"B 10/u 1L ","Christian Neal"]
[null,"Butterfly"]
[45,"G 9yrs 1L","Imogen Neal"]
[null,"Backstroke"]
[46,"B 9 yrs 1L ","Oscar Yates"]
[null,"Backstroke"]
[47,"G 11/u 2L ","Gracie Bull"]
[null,"Freestyle"]
[48,"B 11/u 2L ","Lachlin Woodend"]
[null,"Freestyle"]
[49,"G 12/u 4x1L ","Relay","Jessica Adcock","Lilly Neal"]
[null,"Medley Relay",null,"Isabelle Carpenter-Clay","Libbie Wilks"]
[50,"B 12/u 4x1L","Relay","Alex Walker","Lachlin Woodend"]
[null,"Medley Relay",null,"Solomon Mansfield","Rehan Ali"]
[51,"Mixed 8x1L Freestyle","Relay","Emilia Skelding","Faith Shepherd","Zara Merrick","Jessica Adcock"]
[null,"Relay (1G+1B each age group)",null,"Christian Neal","Adam Walker","Alex Walker","Solomon Mansfield"]

{"sheet":"Lane 3","index":6,"n_rows":104,"n_cols":7,"rows_kept":104,"cut":false,"hidden":false,"merged":[]}
[null,"Club Name"]
[null,"Lane No:"]
[1,"G 10yrs 2L ","Elouise Brookes"]
[null,"Freestyle"]
[2,"B 10/u 2L ","Charlie Hodgetts"]
[null,"Freestyle"]
[3,"G 9 yrs 1L","Harriet Granahan"]
[null,"Breaststroke"]
[4,"B 9 yrs 1L","Harry Chruchley"]
[null,"Breaststroke"]
[5,"G 11/u 4 x 1L ","Relay","Molly Kirkland","Libby Edward"]
[null,"Medley Relay",null,"Sarah Hunt","Caitlin O'Hara"]
[6,"B 11/u 4 x 1L","Relay","Finly Morgan","Saam Withey"]
[null,"Medley Relay",null,"Reece Johnson","Lucas Preece"]
[7,"G 12/u 2L","Ellie Chater"]
[null,"Backstroke"]
[8,"B 12/u 2L ","Sam Nicholson"]
[null,"Backstroke"]
[9,"G 10/u 2L","Izzie Wilkinson"]
[null,"Breaststroke"]
[10,"B 10/u 2L","Charlie Hodgetts"]
[null,"Breaststroke"]
[11,"G 9 yrs 4 x 1L","Relay","Jessica Connor","Harriet Granahan"]
[null,"Medley Relay",null,"Ester McGeough","Pheobe Chater"]
[12,"B 9 yrs 4 x lL","Relay","Callum Anderson","Harry Churchley"]
[null,"Medley Relay",null,"Oliver Jennings","Finlay Johnson"]
[13,"G 11/u 4 x lL",null,"Libby Edwards","Caitlin O'Hara"]
[null,"Freestyle Relay","Relay","Molly Kirkland","Sarah Hunt "]
[14,"B 11/u 4 x 1L",null,"Lucas Preece","Finlay Morgan"]
[null,"Freestyle Relay","Relay","Sam Withey","Reece Johnson"]
[15,"G 12/u 2L","Emily Withey"]
[null,"Butterfly"]
[16,"B 12/u 2L","Harvey Ashead"]
[null," Butterfly"]
[17,"G 10/u 4 x1L","Relay","Elouise Brookes","Izzie Wilkinson"]
[null,"Medley Relay",null,"Hannah Johnson","Cerys Bates"]
[18,"B 10/u 4 x 1L","Relay","Finly Morgan","Charlie Hodgetts"]
[null,"Medley Relay",null,"Christian Morgan","Blake Haddrell"]
[19,"G 11/u 2L","Molly Kirkland"]
[null,"Backstroke"]
[20,"B 11/u 2L","Reece Johnson"]
[null,"Backstroke"]
[21,"G 9 yrs 4 x 1L","Relay","Jessica Connor","Pheobe Chater"]
[null,"Freestyle Relay",null,"Ester McGeough","Finley Massey"]
[22,"B 9 yrs 4x1L","Relay","Ben Chancellor","Finlay Johnson"]
[null,"Freestyle Relay",null,"Callum Anderson","Harry Churchley"]
[23,"G 12/u 2L ","Emily Withey"]
[null,"Breaststroke"]
[24,"B 12/u 2L","Harvey Ashead"]
[null,"Breaststroke"]
[25,"G 10yrs 4 x 1L","Relay","Cerys Bates","Hannah Johnson"]
[null,"Freestyle Relay",null,"Elloiuse Brookes","Izzie Wilkinson"]
[26,"B 10yrs 4 x 1L","Relay","Charlie Hodgetts","Blake Haddrell"]
[null,"Freestyle Relay",null,"Christian Morgan","Finlay Morgan"]
[27,"G 11/u 2L","Sarah Hunt"]
[null,"Butterfly"]
[28,"B 11/u 2L","Reece Johnson"]
[null,"Butterfly"]
[29,"G 9 yrs 1L","Esther McGeough"]
[null,"Butterfly"]
[30,"B 9 yrs 1L","Oliver Jennings"]
[null,"Butterfly"]
[31,"G 12/u 2L","Ellie Chater"]
[null,"Freestyle"]
[32,"B 12/u 2L","Sam Nicholson"]
[null,"Freestyle"]
[33,"G 8 x 1L ","Relay","Finlay Massey","Harriot Granahan","Hannah Johnson","Cerys Bates"]
[null,"Freestyle Relay",null,"Caitlin O'Hara","Libby Edwards","Freya Burns","Olivia Massey"]
[34,"B 10/u 2L","Christian Morgan"]
[null,"Backstroke"]
[35,"G 10/u 2L","Elloiuse Brookes"]
[null,"Backstroke"]
[36,"B 9 yrs 1L","Oliver Jennings"]
[null,"Freestyle"]
[37,"G 9 yrs 1L","Harriet Granahan"]
[null,"Freestyle"]
[38,"B 12/u 4 x 1L","Relay","Freya Burns","Olivia Massey"]
[null,"Freestyle Relay",null,"Ellie Chater","Emily Withey"]
[39,"G 12/u 4 x 1L","Relay","Max York","Alfie Swann"]
[null,"Freestyle Relay",null,"Sam Nicolson","Harbey Ashead"]
[40,"B 11/u 2L","Sam Withey"]
[null,"Breaststroke"]
[41,"G 11/u 2L","Sarah Hunt"]
[null,"Breaststroke"]
[42,"B 8 x 1L ","Relay","Ben Chancellor","Callum Anderson","Blake Haddrell","Charlie Hodgetts"]
[null,"Freestyle Relay",null,"Lucas Preece","Reece Johnson","Max York","Alfie Swann"]
[43,"G 10/u 1L","Hannah Johnson"]
[null,"Butterfly"]
[44,"B 10/u 1L ","Christian Morgan"]
[null,"Butterfly"]
[45,"G 9yrs 1L","Esther McGeough"]
[null,"Backstroke"]
[46,"B 9 yrs 1L ","Callum Anderson"]
[null,"Backstroke"]
[47,"G 11/u 2L ","Molly Kirkland"]
[null,"Freestyle"]
[48,"B 11/u 2L ","Sam Withey"]
[null,"Freestyle"]
[49,"G 12/u 4x1L ","Relay","Ellie Chater","Emily Withey"]
[null,"Medley Relay",null,"Olivia Massey","Freya Burns"]
[50,"B 12/u 4x1L","Relay","Sam Nicholson","Alfie Swann"]
[null,"Medley Relay",null,"Harvey Ashead.","Max York"]
[51,"Mixed 8x1L Freestyle","Relay","Harriot Granahan","Oliver Jennings","Elloiuse Brookes","Charlie Hodgetts"]
[null,"Relay (1G+1B each age group)",null,"Sarah Hunt","Reece Johnson","Ellie Chater","Sam Nicolson"]

{"sheet":"Lane 4","index":7,"n_rows":104,"n_cols":7,"rows_kept":104,"cut":false,"hidden":false,"merged":[]}
[null,"Club Name"]
[null,"Lane No:"]
[1,"G 10yrs 2L ","Khloe Deoso"]
[null,"Freestyle"]
[2,"B 10/u 2L ","Toru Ashton"]
[null,"Freestyle"]
[3,"G 9 yrs 1L","Constance Gwillim"]
[null,"Breaststroke"]
[4,"B 9 yrs 1L","Ethan Ryan"]
[null,"Breaststroke"]
[5,"G 11/u 4 x 1L ","Relay","Cara Miller","Megan O'Reilly"]
[null,"Medley Relay",null,"Eleanor Ribchester","Maddie Bowler"]
[6,"B 11/u 4 x 1L","Relay","Thomas Ribchester","Sonny Butcher"]
[null,"Medley Relay",null,"Kieran O'Reilly","James Williams"]
[7,"G 12/u 2L","Erin Irving"]
[null,"Backstroke"]
[8,"B 12/u 2L ","Thomas Collerhan"]
[null,"Backstroke"]
[9,"G 10/u 2L","Ayla Goucher"]
[null,"Breaststroke"]
[10,"B 10/u 2L","Keiran O'Reilly"]
[null,"Breaststroke"]
[11,"G 9 yrs 4 x 1L","Relay","Larissa Lobban","Freya Lane"]
[null,"Medley Relay",null,"Constance Gwillim","Cassie Kelly-Cooper"]
[12,"B 9 yrs 4 x lL","Relay","Swimmer A","Swimmer B"]
[null,"Medley Relay",null,"Swimmer C","Swimmer D"]
[13,"G 11/u 4 x lL",null,"Eleanor Ribchester","Maddie Bowler"]
[null,"Freestyle Relay","Relay","Megan O'Reilly","Cara Miller"]
[14,"B 11/u 4 x 1L",null,"Thomas Ribchester","Toru Ashton"]
[null,"Freestyle Relay","Relay","Luke Burton","Sonny Butcher"]
[15,"G 12/u 2L","Molly Faber"]
[null,"Butterfly"]
[16,"B 12/u 2L","Dylan Abulencia"]
[null," Butterfly"]
[17,"G 10/u 4 x1L","Relay","Louise Krone","Ayla Goucher"]
[null,"Medley Relay",null,"Khloe Deoso","Eleanor McLennan"]
[18,"B 10/u 4 x 1L","Relay","Luke Burton","Kieran O'Reilly"]
[null,"Medley Relay",null,"Toru Ashton","Ethan Wilcox"]
[19,"G 11/u 2L","Eleanor Ribchester"]
[null,"Backstroke"]
[20,"B 11/u 2L","Thomas Ribchester"]
[null,"Backstroke"]
[21,"G 9 yrs 4 x 1L","Relay","Cassie Kelly-Cooper","Freya Lane"]
[null,"Freestyle Relay",null,"Izzy Nouhov","Larissa Lobhan"]
[22,"B 9 yrs 4x1L","Relay","Swimmer A","Swimmer B"]
[null,"Freestyle Relay",null,"Swimmer C","Swimmer D"]
[23,"G 12/u 2L ","Eve Phillips"]
[null,"Breaststroke"]
[24,"B 12/u 2L","Dylan Abulencia"]
[null,"Breaststroke"]
[25,"G 10yrs 4 x 1L","Relay","Ayla Goucher","Macy Walker"]
[null,"Freestyle Relay",null,"Khloe Deoso","Eleanor McLennan"]
[26,"B 10yrs 4 x 1L","Relay","Kieran O'Reilly","James Williams"]
[null,"Freestyle Relay",null,"Luke Burton","Toru Ashton"]
[27,"G 11/u 2L","Eleanor Ribchester"]
[null,"Butterfly"]
[28,"B 11/u 2L","Sonny Butcher"]
[null,"Butterfly"]
[29,"G 9 yrs 1L","Constance Gwillim"]
[null,"Butterfly"]
[30,"B 9 yrs 1L","Swimmer"]
[null,"Butterfly"]
[31,"G 12/u 2L","Erin Irving"]
[null,"Freestyle"]
[32,"B 12/u 2L","Aiden Irving"]
[null,"Freestyle"]
[33,"G 8 x 1L ","Relay","Constance Gwillim","Izzy Nouhov","Macy Walker","Eleanor McLennan"]
[null,"Freestyle Relay",null,"Megan O'Reilly","Eleanor Ribchester","Erin Irving","Eve Phillips"]
[34,"B 10/u 2L","Luke Burton"]
[null,"Backstroke"]
[35,"G 10/u 2L","Louise Khrone"]
[null,"Backstroke"]
[36,"B 9 yrs 1L","Ethan Ryan"]
[null,"Freestyle"]
[37,"G 9 yrs 1L","Cassie Kelly-Cooper"]
[null,"Freestyle"]
[38,"B 12/u 4 x 1L","Relay","Sam Nouhov","Thomas Colerhan"]
[null,"Freestyle Relay",null,"Dylan Abulencia","Aiden Irving"]
[39,"G 12/u 4 x 1L","Relay","Eve Philips","Molly Faber"]
[null,"Freestyle Relay",null,"Josephine Potter","Erin Irving"]
[40,"B 11/u 2L","Sonny Butcher"]
[null,"Breaststroke"]
[41,"G 11/u 2L","Megan O'Reilly"]
[null,"Breaststroke"]
[42,"B 8 x 1L ","Relay","Ethan Ryan","Luke Burton","James Williams","Ethan Wilcox"]
[null,"Freestyle Relay",null,"Thomas Ribchester","Sonny Butcher","Sam Nouhov","Thomas Colerhan"]
[43,"G 10/u 1L","Ayla Goucher"]
[null,"Butterfly"]
[44,"B 10/u 1L ","Kieran O'Reilly"]
[null,"Butterfly"]
[45,"G 9yrs 1L","Cassie Kelly-Cooper"]
[null,"Backstroke"]
[46,"B 9 yrs 1L ","Swimmer"]
[null,"Backstroke"]
[47,"G 11/u 2L ","Cara Miller"]
[null,"Freestyle"]
[48,"B 11/u 2L ","Thomas Ribchester"]
[null,"Freestyle"]
[49,"G 12/u 4x1L ","Relay","Erin Irving","Josephine Potter"]
[null,"Medley Relay",null,"Molly Faber","Eve Phillips"]
[50,"B 12/u 4x1L","Relay","Thomas Colerhan","Sam Nouhov"]
[null,"Medley Relay",null,"Dylan Abulencia","Aiden Irving"]
[51,"Mixed 8x1L Freestyle","Relay","Cassie Kelly-Cooper","Ethan Ryan","Khloe Deoso","Kieran O'Reilly"]
[null,"Relay (1G+1B each age group)",null,"Eleanor Ribchester","Thomas Ribchester","Erin Irving","Aiden Irving"]

{"sheet":"Lane 5","index":8,"n_rows":104,"n_cols":7,"rows_kept":104,"cut":false,"hidden":false,"merged":[]}
[null,"Club Name"]
[null,"Lane No:"]
[1,"G 10yrs 2L ","Waleeha Qaiser"]
[null,"Freestyle"]
[2,"B 10/u 2L ","Veer Mulji"]
[null,"Freestyle"]
[3,"G 9 yrs 1L","Kiyane Mesref"]
[null,"Breaststroke"]
[4,"B 9 yrs 1L","James Inshaw"]
[null,"Breaststroke"]
[5,"G 11/u 4 x 1L ","Relay","Indigo Perrett","Neveah Choudhury"]
[null,"Medley Relay",null,"Kiyane Mesref","Ava Browne"]
[6,"B 11/u 4 x 1L","Relay","Joe Box","James Inshaw"]
[null,"Medley Relay",null,"Issac Walton","Riley Talbot-Fielding"]
[7,"G 12/u 2L","AJ Finch"]
[null,"Backstroke"]
[8,"B 12/u 2L ","Michael Bushael"]
[null,"Backstroke"]
[9,"G 10/u 2L","Neveah Choudhury"]
[null,"Breaststroke"]
[10,"B 10/u 2L","Joe Box"]
[null,"Breaststroke"]
[11,"G 9 yrs 4 x 1L","Relay","Swimmer A","Swimmer B"]
[null,"Medley Relay",null,"Swimmer C","Swimmer D"]
[12,"B 9 yrs 4 x lL","Relay","Swimmer A","Swimmer B"]
[null,"Medley Relay",null,"Swimmer C","Swimmer D"]
[13,"G 11/u 4 x lL",null,"Indigo Perrett","Neveah Choudhury"]
[null,"Freestyle Relay","Relay","Ava Browne","Waleeha Qaiser"]
[14,"B 11/u 4 x 1L",null,"Issac Walton","Joe Box"]
[null,"Freestyle Relay","Relay","James Inshaw","Riley Talbot-Fielding"]
[15,"G 12/u 2L","Charlotte Inshaw"]
[null,"Butterfly"]
[16,"B 12/u 2L","Alfiie Cowie"]
[null," Butterfly"]
[17,"G 10/u 4 x1L","Relay","Ava Browne","Neveah Choudhury"]
[null,"Medley Relay",null,"Kiyane Mesref","Lucy Talbot-Fielding"]
[18,"B 10/u 4 x 1L","Relay"]
[null,"Medley Relay"]
[19,"G 11/u 2L","Indigo Perrett"]
[null,"Backstroke"]
[20,"B 11/u 2L","Riley Talbot-Fielding"]
[null,"Backstroke"]
[21,"G 9 yrs 4 x 1L","Relay","Swimmer A","Swimmer B"]
[null,"Freestyle Relay",null,"Swimmer C","Swimmer D"]
[22,"B 9 yrs 4x1L","Relay","Swimmer A","Swimmer B"]
[null,"Freestyle Relay",null,"Swimmer C","Swimmer D"]
[23,"G 12/u 2L ","Abigail Tan"]
[null,"Breaststroke"]
[24,"B 12/u 2L","Michael Dutton"]
[null,"Breaststroke"]
[25,"G 10yrs 4 x 1L","Relay","Kiyane Mesref","Neveah Choudhury"]
[null,"Freestyle Relay",null,"Waleeha Qaiser","Lucy Talbot-Fielding"]
[26,"B 10yrs 4 x 1L","Relay"]
[null,"Freestyle Relay"]
[27,"G 11/u 2L","Swimmer"]
[null,"Butterfly"]
[28,"B 11/u 2L","Issac Walton"]
[null,"Butterfly"]
[29,"G 9 yrs 1L","Kiyane Mesref"]
[null,"Butterfly"]
[30,"B 9 yrs 1L","James Inshaw"]
[null,"Butterfly"]
[31,"G 12/u 2L","Grace Fatchett"]
[null,"Freestyle"]
[32,"B 12/u 2L","Alfiie Cowie"]
[null,"Freestyle"]
[33,"G 8 x 1L ","Relay","Kiyane Mesref","Lucy Talbot-Fielding","Indigo Perrett","Charlotte Inshaw"]
[null,"Freestyle Relay",null,"Ava Browne","Waleeha Qaiser","Neveah Choudhury","Abigail Tab"]
[34,"B 10/u 2L","Veer Mulji"]
[null,"Backstroke"]
[35,"G 10/u 2L","Neveah Choudhury"]
[null,"Backstroke"]
[36,"B 9 yrs 1L"]
[null,"Freestyle"]
[37,"G 9 yrs 1L","Lucy Talbot-Fielding"]
[null,"Freestyle"]
[38,"B 12/u 4 x 1L","Relay","Alfie Cowie","Michael Bushael"]
[null,"Freestyle Relay",null,"Michael Dutton","Issac Walton"]
[39,"G 12/u 4 x 1L","Relay","Charlotte Inshaw","Abigail Tan"]
[null,"Freestyle Relay",null,"AJ Finch","Gracie Fatchett"]
[40,"B 11/u 2L","Issac Walton"]
[null,"Breaststroke"]
[41,"G 11/u 2L","Neveah Choudhury"]
[null,"Breaststroke"]
[42,"B 8 x 1L ","Relay"]
[null,"Freestyle Relay"]
[43,"G 10/u 1L","Kiyane Mesref"]
[null,"Butterfly"]
[44,"B 10/u 1L ","Joe Box"]
[null,"Butterfly"]
[45,"G 9yrs 1L","Ava Browne"]
[null,"Backstroke"]
[46,"B 9 yrs 1L ","Luka Prodan"]
[null,"Backstroke"]
[47,"G 11/u 2L ","Indigo Perrett"]
[null,"Freestyle"]
[48,"B 11/u 2L ","Riley Talbot-Fielding"]
[null,"Freestyle"]
[49,"G 12/u 4x1L ","Relay","Charlotte Inshaw","Gracie Fatchett"]
[null,"Medley Relay",null,"Abigail Tan","AJ Finch"]
[50,"B 12/u 4x1L","Relay","Michael Bushael","Issac Walton"]
[null,"Medley Relay",null,"Alfie Cowie","Michael Dutton"]
[51,"Mixed 8x1L Freestyle","Relay","Ava Browne","Neveah Choudhury","Indigo Perrett","Charlotte Inshaw"]
[null,"Relay (1G+1B each age group)",null,"James Inshaw","Joe Box","Issac Walton","Alfie Cowie"]

{"sheet":"Lane 6","index":9,"n_rows":104,"n_cols":7,"rows_kept":104,"cut":false,"hidden":false,"merged":[]}
[null,"Club Name"]
[null,"Lane No:"]
[1,"G 10yrs 2L ","S Warrilow"]
[null,"Freestyle"]
[2,"B 10/u 2L ","W Bottrill"]
[null,"Freestyle"]
[3,"G 9 yrs 1L","M Khera"]
[null,"Breaststroke"]
[4,"B 9 yrs 1L","J Watson"]
[null,"Breaststroke"]
[5,"G 11/u 4 x 1L ","Relay","R Powell","A Imram"]
[null,"Medley Relay",null,"E Hendon","J Munslow"]
[6,"B 11/u 4 x 1L","Relay","H Bottrill","A Guild"]
[null,"Medley Relay",null,"B Webb","E Terry"]
[7,"G 12/u 2L","R Powell"]
[null,"Backstroke"]
[8,"B 12/u 2L ","H Bottrill"]
[null,"Backstroke"]
[9,"G 10/u 2L","M Khera"]
[null,"Breaststroke"]
[10,"B 10/u 2L","W Bottrill"]
[null,"Breaststroke"]
[11,"G 9 yrs 4 x 1L","Relay","M Munslow","M Khera"]
[null,"Medley Relay",null,"K Bell","T Rollins"]
[12,"B 9 yrs 4 x lL","Relay","R Smith","F Corroll"]
[null,"Medley Relay",null,"J Watson","N Kalitat"]
[13,"G 11/u 4 x lL",null,"E Hendon","R Powell"]
[null,"Freestyle Relay","Relay","A Ingram","J Munslow"]
[14,"B 11/u 4 x 1L",null,"B Webb","A Guild"]
[null,"Freestyle Relay","Relay","E Terry","H Bottrill"]
[15,"G 12/u 2L","A Robathan"]
[null,"Butterfly"]
[16,"B 12/u 2L","C Fletcher"]
[null," Butterfly"]
[17,"G 10/u 4 x1L","Relay","S Warrilow","M Khera"]
[null,"Medley Relay",null,"T Rollins","K Bell"]
[18,"B 10/u 4 x 1L","Relay","J Bottrill","W Bottrill"]
[null,"Medley Relay",null,"T Mobbs","W Gorton"]
[19,"G 11/u 2L","R Powell"]
[null,"Backstroke"]
[20,"B 11/u 2L","H Bottrill"]
[null,"Backstroke"]
[21,"G 9 yrs 4 x 1L","Relay","M Munslow","B Taylor"]
[null,"Freestyle Relay",null,"E Hunt","M Khera"]
[22,"B 9 yrs 4x1L","Relay","J Watson","N Kalitat"]
[null,"Freestyle Relay",null,"R Smith","F Corroll"]
[23,"G 12/u 2L ","E Rollins"]
[null,"Breaststroke"]
[24,"B 12/u 2L","C Fletcher"]
[null,"Breaststroke"]
[25,"G 10yrs 4 x 1L","Relay","B Taylor","E Hunt"]
[null,"Freestyle Relay",null,"T Rollins","S Warrilow"]
[26,"B 10yrs 4 x 1L","Relay","W Bottrill","J Bottrill"]
[null,"Freestyle Relay",null,"T Mobbs","W Gorton"]
[27,"G 11/u 2L","E Hendon"]
[null,"Butterfly"]
[28,"B 11/u 2L","B Webb"]
[null,"Butterfly"]
[29,"G 9 yrs 1L","K Bell"]
[null,"Butterfly"]
[30,"B 9 yrs 1L","Swimmer"]
[null,"Butterfly"]
[31,"G 12/u 2L","E Rollins"]
[null,"Freestyle"]
[32,"B 12/u 2L","B Webb"]
[null,"Freestyle"]
[33,"G 8 x 1L ","Relay","M Munslow","T Rollins","M Khera","B Taylor"]
[null,"Freestyle Relay",null,"O Kelly","A Ingram","E Rollins","A Robathan"]
[34,"B 10/u 2L","T Mobbs"]
[null,"Backstroke"]
[35,"G 10/u 2L","S Warrilow"]
[null,"Backstroke"]
[36,"B 9 yrs 1L","J Watson"]
[null,"Freestyle"]
[37,"G 9 yrs 1L","M Munslow"]
[null,"Freestyle"]
[38,"B 12/u 4 x 1L","Relay","B Webb","E Terry"]
[null,"Freestyle Relay",null,"C Fletcher","M Dowd"]
[39,"G 12/u 4 x 1L","Relay","E Rollins","R Powell"]
[null,"Freestyle Relay",null,"A Robathan","E Hendon"]
[40,"B 11/u 2L","A Guild"]
[null,"Breaststroke"]
[41,"G 11/u 2L","A Ingram"]
[null,"Breaststroke"]
[42,"B 8 x 1L ","Relay","J Watson","N Kalitat","W Bottrill","J Bottrill"]
[null,"Freestyle Relay",null,"B Webb","E Terry","M Dowd","C Fletcher"]
[43,"G 10/u 1L"]
[null,"Butterfly"]
[44,"B 10/u 1L ","T Mobbs"]
[null,"Butterfly"]
[45,"G 9yrs 1L","M Munslow"]
[null,"Backstroke"]
[46,"B 9 yrs 1L ","N Kalitat"]
[null,"Backstroke"]
[47,"G 11/u 2L ","R Powell"]
[null,"Freestyle"]
[48,"B 11/u 2L ","B Webb"]
[null,"Freestyle"]
[49,"G 12/u 4x1L ","Relay","R Powell","E Rollins"]
[null,"Medley Relay",null,"A Robathan","E Hendon"]
[50,"B 12/u 4x1L","Relay","M Dowd","C Fletcher"]
[null,"Medley Relay",null,"B Webb","E Terry"]
[51,"Mixed 8x1L Freestyle","Relay","M Munslow","J Watson","N Thera","T Mobbs"]
[null,"Relay (1G+1B each age group)",null,"A Ingram","B Webb","E Rollins","C Fletcher"]